{"text_format":"1","workbook":"xlsx","n_sheets":12,"sheets":["KALKULATOR podpor","Pojasnila","Izračuni 2009-2016","OPOMBE","Podpore 2014","Podpore 2016","Podpore 2013","Podpore 2012","Metodologija - OU in spec I str","Šifranti","Primerjava stari - novi 2010","Stara shema"],"not_rendered":{"charts":0,"images":6,"macros":1,"external_links":1,"defined_names":8,"comments":3,"pivot_tables":0},"unopened":[],"bounds":{"document_bytes":16777216,"sheet_cells":100000,"rows_first":2000,"rows_last":500,"rows_between":2000,"halvings":0,"cell_chars":16384,"cell_head_chars":4096},"cells_cut":0,"cells_raw":0,"read":"whole","date_system":"1900"}

{"sheet":"KALKULATOR podpor","index":0,"n_rows":45,"n_cols":28,"rows_kept":45,"cut":false,"hidden":false,"merged":[[23,0,28,0],[31,0,42,0]]}
[]
[null,null,null,null,null,null,null,null,null,null,null,null,null,null,null,null,null,null,null,null,null,null,null,null,null,"POMOČ PRI KODAH"]
[null,null,null,null,null,null,null,null,null,null,null,null,null,null,null,null,null,null,null,null,null,null,null,null,null,"HE0","hidroelektrarne"]
[null,null,null,null,null,null,null,null,null,null,null,null,null,null,null,null,null,null,null,null,null,null,null,null,null,"VE0","vetrne elektrarne"]
["Inačica: 27nov15; PRAVNO POJASNILO:",null,null,null,null,null,null,null,null,null,null,null,null,null,null,null,null,null,null,null,null,null,null,null,null,"SE1","sončne elektrarne - na stavbah"]
["Izračun je izključno informativne narave. Borzen, d.o.o. ne prevzema nobenih garancij o točnosti izračunov.",null,null,null,null,null,null,null,null,null,null,null,null,null,null,null,null,null,null,null,null,null,null,null,null,"SE2","sončne elektrarne - ostale"]
["Vsi uporabniki vso objavljeno vsebino uporabljajo izključno na lastno odgovornost.",null,null,null,null,null,null,null,null,null,null,null,null,null,null,null,null,null,null,null,null,null,null,null,null,"GT0","geotermalne elektrarne"]
[null,null,null,null,null,null,null,null,null,null,null,null,null,null,null,null,null,null,null,null,null,null,null,null,null,"LB1","elektrarne na lesno biomaso"]
[null,"VPIŠI KODO",null,{"$f":"IF(LEFT(C9,2)=\"se\",D10,C9)","v":0},{"$f":"SEARCH(\"SE1\",$C$9)","v":{"$error":"#VALUE!"}},{"$f":"SEARCH(\"SE\",$C$9)","v":{"$error":"#VALUE!"}},null,null,null,null,null,null,null,null,null,null,null,null,null,null,null,null,null,null,null,"LB2","sosežig nad 5% do 90%"]
[null,"Izračun podpore za leto:",null,{"$f":"IF(C14>2008,D13,CONCATENATE(C9,\"-2009\"))","v":"-2009"},{"$f":"SEARCH(\"GT\",$C$9)","v":{"$error":"#VALUE!"}},{"$f":"SEARCH(\"BP\",$C$9)","v":{"$error":"#VALUE!"}},{"$f":"SEARCH(\"ČN\",$C$9)","v":{"$error":"#VALUE!"}},{"$f":"SEARCH(\"OP\",$C$9)","v":{"$error":"#VALUE!"}},{"$f":"SEARCH(\"BO\",$C$9)","v":{"$error":"#VALUE!"}}]
[null,"Vpiši odbitke v EUR/MWh",null,null,{"$f":"SEARCH(\"LB1\",$C$9)","v":{"$error":"#VALUE!"}},{"$f":"SEARCH(\"LB2\",$C$9)","v":{"$error":"#VALUE!"}},{"$f":"SEARCH(\"SL\",$C$9)","v":{"$error":"#VALUE!"}},null,null,null,null,null,null,null,null,null,null,null,null,null,null,null,null,null,null,"BP1","bioplin iz biomase"]
[null,"(odbitki zaradi subvencij / obnov)",null,null,null,null,null,null,null,null,null,null,null,null,null,null,null,null,null,null,null,null,null,null,null,"BP2","bioplin iz odpadkov"]
[null,{"$f":"IF(ISERROR(E9),\"\",IF(C14=2012,\"\",\"Integrirana (do2011) ali PX3 bonus (od dec2012 - max 5kW)? (1-DA, 0-NE)\"))","v":""},null,{"$f":"CONCATENATE(C9,\"-\",C14)","v":"-"},{"$f":"IF(C10=2011,3,0)","v":0},{"$f":"IF(C10=2011,2,0)","v":0},null,null,null,null,null,null,null,null,null,null,null,null,null,null,null,null,null,null,null,"ČN0","bioplin iz čistilnih naprav"]
[null,{"$f":"IF(ISERROR(F9),\"\",\"RSEE 2009 / 2010 / 2011 / 2012H1 / 2012H2 / 2012dec / 2013mmm / 2014mmm \")","v":""},null,null,null,null,null,null,null,null,null,null,null,null,null,null,null,null,null,null,null,null,null,null,null,"OP0","odlagališčni plin"]
[null,{"$f":"IF(OR(ISNUMBER(E10),ISNUMBER(F10),ISNUMBER(G10),ISNUMBER(H10),ISNUMBER(I10)),\"Vpiši dodatek na OP v %\",\"\")","v":""},null,"napake",{"$f":"IF(ISNUMBER(C10),OR(C10>2016,C10<2009))","v":false},{"$f":"IF(ISBLANK(C9),0,ISERROR(C24))","v":0},{"$f":"IF(AND(ISNUMBER(C14),C14>C10),1,0)","v":0},{"$f":"E15+F15+G15","v":0},null,null,null,null,null,null,null,null,null,null,null,null,null,null,null,null,null,"BO0","biološko razgradljivi odpadki"]
[null,{"$f":"IF(OR(ISNUMBER(E11),ISNUMBER(F11),ISNUMBER(G11)),\"Vpiši dodatek/odbitek za LB na SDRS v %\",\"\")","v":""},null,null,null,null,null,null,null,null,null,null,null,null,null,null,null,null,null,null,null,null,null,null,null,"SL1","SPTE na lesno biomaso do 4000 OU"]
[null,{"$f":"IF(ISERROR(F10),\"\",\"Ali ima 70% RSEE (1-DA)?\")","v":""},null,null,null,null,null,null,null,null,null,null,null,null,null,null,null,null,null,null,null,null,null,null,null,"SL2","SPTE na lesno biomaso nad 4000 OU"]
[null,null,null,null,null,null,null,null,null,null,null,null,null,null,null,null,null,null,null,null,null,null,null,null,null,"SF1","SPTE na fosilna goriva do 4000 OU"]
[null,"Tip",{"$f":"VLOOKUP($D$9,'Izračuni 2009-2016'!$A$2:$BA$321,2,FALSE)","v":{"$error":"#N/A"}},null,null,null,null,null,null,null,null,null,null,null,null,null,null,null,null,null,null,null,null,null,null,"SF2","SPTE na fosilna goriva nad 4000 OU"]
[null,"Velikost",{"$f":"VLOOKUP($D$9,'Izračuni 2009-2016'!$A$2:$BA$321,4,FALSE)","v":{"$error":"#N/A"}}]
[null,"Faktor B",{"$f":"VLOOKUP($D$9,'Izračuni 2009-2016'!$A$2:$BA$321,32,FALSE)","v":{"$error":"#N/A"}},null,null,null,null,null,null,null,null,null,null,null,null,null,null,null,null,null,null,null,null,null,null,"Velikostni razredi OVE"]
[null,"Pripomba - skladnost Uredba?",{"$f":"VLOOKUP($D$9,'Izračuni 2009-2016'!$A$2:$BA$321,43,FALSE)","v":{"$error":"#N/A"}},null,null,{"$f":"IS","v":{"$error":"#NAME?"}},null,null,null,null,null,null,null,null,null,null,null,null,null,null,null,null,null,null,null,1,"mikro - manjše od 50kW"]
[null,null,null,null,null,null,null,null,null,null,null,null,null,null,null,null,null,null,null,null,null,null,null,null,null,2,"mala - manjše od 1MW"]
["za skupino","NDRS brez odbitkov / dodatkov",{"$f":"VLOOKUP($D$9,'Izračuni 2009-2016'!$A$2:$BA$321,D32,FALSE)","v":{"$error":"#N/A"}},null,null,null,null,null,{"$f":"C33/C24","v":{"$error":"#VALUE!"}},null,null,null,null,null,"NAVODILA",null,null,null,null,null,null,null,null,null,null,3,"srednja - od 1MW do vključno 10MW "]
[null,"SDRS brez odbitkov / dodatkov",{"$f":"VLOOKUP($D$9,'Izračuni 2009-2016'!$A$2:$BA$321,D33,FALSE)","v":{"$error":"#N/A"}},null,null,"leta",null,null,null,null,null,null,null,null,"1. V celico C9 vpiši kodo (glej pomoč pri strani)",null,null,null,null,null,null,null,null,null,null,4,"velika - nad 10MW do vključno 125MW"]
[null,"Skupni brez odbitkov / dodatkov",{"$f":"VLOOKUP($D$9,'Izračuni 2009-2016'!$A$2:$BA$321,D34,FALSE)","v":{"$error":"#N/A"}},null,null,2009,null,null,null,null,null,null,null,null,"2. V C10 pa leto za izračun"]
[null,{"$f":"IF(C25>0,\"SDRS(0) - 2009 po uredbi\",\"\")","v":{"$error":"#N/A"}},{"$f":"IF(C25>0,VLOOKUP($D$9,'Izračuni 2009-2016'!$A$2:$BA$321,7,FALSE),\"\")","v":{"$error":"#N/A"}},null,null,2010,null,null,null,null,null,null,null,null,"2. V roza obarvane celice vpiši podatek, če zahtevan",null,null,null,null,null,null,null,null,null,null,"Velikostni razredi SPTE"]
[null,"Splošni ZO v EUR/MWh",{"$f":"VLOOKUP($D$9,'Izračuni 2009-2016'!$A$2:$BA$321,D35,FALSE)","v":{"$error":"#N/A"}},null,null,2011,null,null,null,null,null,null,null,null,"3. Gumb RESET počisti obrazec",null,null,null,null,null,null,null,null,null,null,1,"mikro - manjše od 50kW"]
[null,"Splošni OP v EUR/MWh",{"$f":"VLOOKUP($D$9,'Izračuni 2009-2016'!$A$2:$BA$321,D36,FALSE)","v":{"$error":"#N/A"}},null,null,2012,null,null,null,null,null,null,null,null,"4. Pomoč za dodatke lesna biomasa desno spodaj",null,null,null,null,null,null,null,null,null,null,2,"mala - manjše od 1MW"]
[null,null,null,null,null,2013,null,null,null,null,null,null,null,null,"Podpore SF so v primeru spremembe cene plina za ",null,null,null,null,null,null,null,null,null,null,3,"srednja - nižja - od 1MW do vključno 5MW"]
[null,null,null,null,null,2014,null,null,null,null,null,null,null,null,"drugo polovico leta!",null,null,null,null,null,null,null,null,null,null,4,"srednja - višja - nad 5MW do vključno 25MW"]
["za konkretno enoto","Veljavni NDRS",{"$f":"IF(ISNUMBER(C24),ROUND(C24+C13*(IF(C14<2012,0.15,0.05))*C24,2)-ROUND(ABS(C11),2),\"\")","v":""},{"$f":"HLOOKUP($C$10,$F$35:$M$41,2,FALSE)","v":{"$error":"#N/A"}},null,2015,null,null,null,null,null,null,null,"z upoštevanimi dodatki (INT) in odbitki iz celice C3",null,null,null,null,null,null,null,null,null,null,null,5,"velika - nižja - nad 25MW do vključno 50MW"]
[null,"od tega kot dodatek za INT ali PX3",{"$f":"IF(ISNUMBER(C24),ROUND(C13*(IF(C14<2012,0.15,0.05))*C24,2),\"\")","v":""},{"$f":"HLOOKUP($C$10,$F$35:$M$41,3,FALSE)","v":{"$error":"#N/A"}},null,2016,null,null,null,null,null,null,null,null,null,null,null,null,null,null,null,null,null,null,null,6,"velika - višja - nad 50MW do 200MW"]
[null,"Veljavni SDRS",{"$f":"IF(AND(C17=1,ISNUMBER(C25)),ROUND(C17*0.7*C25,2),IF(ISNUMBER(C25),ROUND(C25+C16/100*C25,2),\"\"))","v":""},{"$f":"HLOOKUP($C$10,$F$35:$M$41,4,FALSE)","v":{"$error":"#N/A"}},null,"številke stolpcev za NDRS/SDRS/skupni/ZO/OP",null,null,null,null,null,null,null,"z upoštevanimi dodatki / odbitki (LB)"]
[null,"od tega kot dodatek",{"$f":"IF(ISNUMBER(C25),ROUND(C16/100*C25,2),\"\")","v":""},{"$f":"HLOOKUP($C$10,$F$35:$M$41,5,FALSE)","v":{"$error":"#N/A"}},null,2009,2010,2011,2012,2013,2014,2015,2016]
[null,"Skupni veljavni",{"$f":"IF(ISNUMBER(C26),C32+C34,\"\")","v":""},{"$f":"HLOOKUP($C$10,$F$35:$M$41,6,FALSE)","v":{"$error":"#N/A"}},"ndrs",6,11,14,17,20,23,26,29,null,null,null,null,null,null,null,null,null,null,null,null,"POMOČ ZA IZRAČUN DODATKOV ZA LESNO BIOMASO"]
[null,null,null,{"$f":"HLOOKUP($C$10,$F$35:$M$41,7,FALSE)","v":{"$error":"#N/A"}},"sdrs",7,12,15,18,21,24,27,30,null,null,null,null,null,null,null,null,null,null,null,null,"Tip biomase","SDRS","Delež v %"]
[null,"ZO v EUR/MWh",{"$f":"IF(ISNUMBER(C28),ROUND(C36,5),C28)","v":{"$error":"#N/A"}},null,"skupni",9,13,16,19,22,25,28,31,"brez morebitnih dodatkov vezanih na OP",null,null,null,null,null,null,null,null,null,null,null,"A1 s certifikati",0.1]
[null,"OP v EUR/MWh",{"$f":"IF(ISNUMBER(C29),IF(ISNUMBER(C21),ROUND((C36-C21*D37),2),C29),C29)","v":{"$error":"#N/A"}},null,"zo",33,39,41,43,45,47,49,51,"brez morebitnih dodatkov vezanih na OP",null,null,null,null,null,null,null,null,null,null,null,"A1",0]
[null,"dodatek vezan na OP v EUR/MWh",{"$f":"IF(ISNUMBER(C39),ROUND(C15/100*C29,2),\"\")","v":""},null,"op",36,40,42,44,46,48,50,52,null,null,null,null,null,null,null,null,null,null,null,null,"A2",-0.1]
[null,null,null,null,"tržna cena",{"$f":"'Izračuni 2009-2016'!$L$326","v":65},{"$f":"'Izračuni 2009-2016'!$K$326","v":53.41},{"$f":"'Izračuni 2009-2016'!$J$326","v":53.13},{"$f":"'Izračuni 2009-2016'!$I$326","v":55.79},50.66,43.31,39.65,36.89,null,null,null,null,null,null,null,null,null,null,null,null,"A3",-0.35]
[null,"Končni ZO v EUR/kWh",{"$f":"IF(ISNUMBER(C38),IF(ISNUMBER(C40),(ROUND((C38+C40)/1000,5)),(ROUND((C38)/1000,5))),C38)","v":{"$error":"#N/A"}},null,null,null,null,null,null,null,null,null,null,"za leto",null,null,null,null,null,null,null,null,null,null,null,"Tehtana sprememba SDRS",null,{"$f":"IF(SUM(AB38:AB41)=100,(AB38*AA38/100)+(AB39*AA39/100)+(AB40*AA40/100)+(AB41*AA41/100),\"napaka v deležih!\")","v":"napaka v deležih!"}]
[null,"Končni OP v EUR/kWh",{"$f":"IF(ISNUMBER(C39),IF(ISNUMBER(C40),(ROUND((C39+C40)/1000,5)),(ROUND((C39)/1000,5))),C39)","v":{"$error":"#N/A"}},null,null,null,null,null,null,null,null,null,null,{"$f":"C10","v":0},{"$f":"IF(C17=1,\"Pozor, bioplinarna z znižanimi SDRS!\",\"\")","v":""},null,null,null,null,null,null,null,null,null,null,null,null,"(vnos v C9 v odstotkih, brez znaka \"%\")"]
[null,{"$f":"IF(H15>0,\"Napaka v vnosnih poljih!\",\"\")","v":""}]
[null,{"$f":"IF(AND(C14=2012,C13=1),\"Napaka - v 2012 ni več dodatka INT!\",\"\")","v":""}]

{"sheet":"Pojasnila","index":1,"n_rows":19,"n_cols":2,"rows_kept":19,"cut":false,"hidden":false,"merged":[[3,0,5,0],[7,0,8,0],[12,0,13,0]]}
["Za pravilno delovanje kalkulatorja mora biti omogočeno delovanje makrojev!"]
[]
["TEMA","POJASNILO"]
["VPIŠI KODO","Kode so sestavljene na naslednji način: prva dva znaka določata tip naprave, sledi številka glede podvrste in zadnja številka, ki določa velikostni razred."]
[null,"Ta se razlikuje med OVE (4 razredi) in SPTE (6 razredov)"]
[null,"Primer: SE21 … sončne elekrtrarne (SE), ostale (2), mikro do 50kW (1) = SE21"]
["Vpiši odbitke v EUR/MWh","Odbitki kot bi bili določeni na odločbi Agencije za energijo (v EUR/MWh), na primer zaradi subvencij ali pri vstopu obnovljenih naprav, kjer je delež pod 100%"]
["Integrirana (do2011) ali PX3 bonus (od dec2012 - max 5kW)? (1-DA, 0-NE)","Ali gre za integrirano sončno elektrarno (relevantno le za postavitve do leta 2011) oziroma ali ima dodatek na notranji priklop"]
[null,"(relevantno le za postavitve od decembra 2012 dalje, ter moči do 5kW)"]
["RSEE 2009 / 2010 / 2011 / 2012H1 / 2012H2 / 2012dec / 2013mmm / 2014mmm","Leto oziroma mesec priznanih referenčnih stroškov oziroma obdobje postavitve / priklopa elektrarne (npr. 2009, 2013feb, 2012dec)"]
["Vpiši dodatek na OP v %","Dodatek na obratovalno podporo v % - denimo zaradi koristne rabe toplote, rabe gnojevke (primer: 10)"]
["Vpiši dodatek/odbitek za LB na SDRS v %","Dodatek ali odbitek pri spremenljivem delu stroškov (SDRS) vezan na vrsto uporabljene lesne biomase (pomoč desno spodaj od kalkulatorja)"]
["Ali ima 70% RSEE (1-DA)?","Proizvodnim napravam na bioplin, ki za proizvodnjo bioplina uporabljajo substrat, ki vsebuje več kot 25 in manj kot 40 prostorninskih odstotkov zrnja oziroma"]
[null,"silaže prvih posevkov koruze in drugih pravih žit, se določi spremenljivi del referenčnih stroškov v višini 70 %."]
["NDRS","nespremenljivi del referečnih stroškov"]
["SDRS","spremenljivi del referenčnih stroškov"]
["ZO","zagotovljeni odkup"]
["OP","obratovalna podpora"]
["od tega kot dodatek za INT ali PX3","del vezan na dodatek za integrirane sončne elektrarne (postavitve do 2011) oz interni priklop (postavitve od dec2012 dalje, do največ 5kW)"]

{"sheet":"Izračuni 2009-2016","index":2,"n_rows":347,"n_cols":63,"rows_kept":347,"cut":false,"hidden":true,"merged":[[33,2,36,2],[37,2,40,2],[41,2,44,2],[285,2,288,2],[289,2,292,2],[45,2,48,2],[49,2,52,2],[53,2,56,2],[57,2,60,2],[61,2,64,2],[65,2,68,2],[69,2,72,2],[73,2,76,2],[77,2,80,2],[81,2,84,2],[85,2,88,2],[334,2,337,2],[297,2,302,2],[303,2,308,2],[309,2,314,2],[315,2,320,2],[340,2,346,2],[1,2,4,2],[5,2,8,2],[9,2,12,2],[13,2,16,2],[17,2,20,2],[293,2,296,2],[21,2,24,2],[25,2,28,2],[29,2,32,2],[261,2,264,2],[265,2,268,2],[269,2,272,2],[273,2,276,2],[277,2,280,2],[281,2,284,2],[89,2,92,2],[93,2,96,2],[97,2,100,2],[101,2,104,2],[105,2,108,2],[109,2,112,2],[113,2,116,2],[117,2,120,2],[121,2,124,2],[125,2,128,2],[149,2,152,2],[153,2,156,2],[157,2,160,2],[161,2,164,2],[129,2,132,2],[133,2,136,2],[137,2,140,2],[141,2,144,2],[145,2,148,2],[165,2,168,2],[169,2,172,2],[173,2,176,2],[177,2,180,2],[181,2,184,2],[185,2,188,2],[189,2,192,2],[193,2,196,2],[197,2,200,2],[201,2,204,2],[205,2,208,2],[209,2,212,2],[213,2,216,2],[217,2,220,2],[221,2,224,2],[245,2,248,2],[249,2,252,2],[253,2,256,2],[257,2,260,2],[225,2,228,2],[229,2,232,2],[233,2,236,2],[237,2,240,2],[241,2,244,2]]}
[null,null,null,null,"KODA","NDRS 2009 po uredbi","SDRS 2009 po uredbi","Skupni 2009 po uredbi","Skupni 2009 seštevek","Skladnost skupni","NDRS 2010","SDRS 2010","Skupni 2010","NDRS 2011","SDRS 2011","Skupni 2011","NDRS 2012","SDRS 2012","Skupni 2012","NDRS 2013","SDRS 2013","Skupni 2013","NDRS 2014","SDRS 2014","Skupni 2014","NDRS 2015","SDRS 2015","Skupni 2015","NDRS 2016","SDRS 2016","Skupni 2016","Faktor B po Prilogi III","Cena ZO 2009 po uredbi","Cena ZO 2009 izračunana","Cena ZO 2009 skladna ","Višina OP 2009 po uredbi","Višina OP 2009 izračunana","Višina OP 2009 skladna","Cena ZO 2010","Višina OP 2010","Cena ZO 2011","Višina OP 2011","Cena ZO 2012","Višina OP 2012","Cena ZO 2013","Višina OP 2013","Cena ZO 2014","Višina OP 2014","Cena ZO 2015","Višina OP 2015","Cena ZO 2016","Višina OP 2016","OPOMBE za kategorijo","ZO2012 - ZO2011","OP2012 - OP2011","ZO2013 - ZO2012","OP2013 - OP2012","ZO2014 - ZO2013","OP2014 - OP2013","ZO2015 - ZO2014","OP2015 - OP2014","ZO2016 - ZO2015","OP2016 - OP2015"]
["HE01","1. Hidroelektrarne","1. Hidroelektrarne","mikro - manjše od 50kW","HE01",105.47,0,105.47,{"$f":"F2+G2","v":105.47},{"$f":"IF(H2=I2,\"OK\",\"razlika\")","v":"OK"},{"$f":"F2","v":105.47},0,{"$f":"K2+L2","v":105.47},{"$f":"F2","v":105.47},0,{"$f":"N2+O2","v":105.47},{"$f":"F2","v":105.47},0,{"$f":"Q2+R2","v":105.47},{"$f":"F2","v":105.47},0,{"$f":"T2+U2","v":105.47},{"$f":"F2","v":105.47},0,{"$f":"W2+X2","v":105.47},{"$f":"+W2","v":105.47},{"$f":"+X2","v":0},{"$f":"+Z2+AA2","v":105.47},{"$f":"+Z2","v":105.47},{"$f":"+AA2","v":0},{"$f":"+AC2+AD2","v":105.47},0.86,105.47,{"$f":"I2","v":105.47},{"$f":"IF(AG2=AH2,\"OK\",\"razlika\")","v":"OK"},49.57,{"$f":"ROUND(I2-AF2*$L$326,2)","v":49.57},{"$f":"IF(AJ2=AK2,\"OK\",\"razlika\")","v":"OK"},{"$f":"K2+L2","v":105.47},{"$f":"ROUND((K2+L2)-AF2*$K$326,2)","v":59.54},{"$f":"N2+O2","v":105.47},{"$f":"ROUND((N2+O2)-AF2*$J$326,2)","v":59.78},{"$f":"Q2+R2","v":105.47},{"$f":"ROUND((Q2+R2)-AF2*$I$326,2)","v":57.49},{"$f":"T2+U2","v":105.47},{"$f":"ROUND((T2+U2)-AF2*$H$326,2)","v":61.9},{"$f":"W2+X2","v":105.47},{"$f":"ROUND((W2+X2)-AF2*$G$326,2)","v":68.22},{"$f":"+Z2+AA2","v":105.47},{"$f":"ROUND((Z2+AA2)-AF2*$F$326,2)","v":71.37},{"$f":"+AC2+AD2","v":105.47},{"$f":"ROUND((AC2+AD2)-AF2*$E$326,2)","v":73.739999999999995},null,{"$f":"AQ2-AO2","v":0},-2.2899999999999991,0,4.4099999999999966,0,6.32,{"$f":"AW2-AU2","v":0},{"$f":"AX2-AV2","v":3.1500000000000057},{"$f":"AY2-AW2","v":0},{"$f":"AZ2-AX2","v":2.3699999999999903}]
["HE02","1. Hidroelektrarne",null,"mala - manjše od 1MW","HE02",92.61,0,92.61,92.61,{"$f":"IF(H3=I3,\"OK\",\"razlika\")","v":"OK"},{"$f":"F3","v":92.61},0,{"$f":"K3+L3","v":92.61},92.61,0,{"$f":"N3+O3","v":92.61},92.61,0,{"$f":"Q3+R3","v":92.61},92.61,0,{"$f":"T3+U3","v":92.61},{"$f":"F3","v":92.61},0,{"$f":"W3+X3","v":92.61},92.61,0,92.61,{"$f":"+Z3","v":92.61},{"$f":"+AA3","v":0},{"$f":"+AC3+AD3","v":92.61},0.86,92.61,{"$f":"I3","v":92.61},{"$f":"IF(AG3=AH3,\"OK\",\"razlika\")","v":"OK"},36.71,36.71,{"$f":"IF(AJ3=AK3,\"OK\",\"razlika\")","v":"OK"},{"$f":"K3+L3","v":92.61},46.68,{"$f":"N3+O3","v":92.61},46.92,{"$f":"Q3+R3","v":92.61},44.63,{"$f":"T3+U3","v":92.61},49.04,{"$f":"W3+X3","v":92.61},55.36,{"$f":"+Z3+AA3","v":92.61},58.51,{"$f":"+AC3+AD3","v":92.61},{"$f":"ROUND((AC3+AD3)-AF3*$E$326,2)","v":60.88},null,{"$f":"AQ3-AO3","v":0},{"$f":"AR3-AP3","v":-2.2899999999999991},{"$f":"AS3-AQ3","v":0},{"$f":"AT3-AR3","v":4.4099999999999966},{"$f":"AU3-AS3","v":0},{"$f":"AV3-AT3","v":6.32},{"$f":"AW3-AU3","v":0},{"$f":"AX3-AV3","v":3.1499999999999986},0,2.3700000000000045]
["HE03","1. Hidroelektrarne",null,"srednja - od 1MW do vključno 10MW ","HE03",82.34,0,82.34,82.34,"OK",82.34,0,82.34,82.34,0,82.34,82.34,0,82.34,82.34,0,82.34,82.34,0,82.34,82.34,0,82.34,82.34,0,82.34,0.9,82.34,{"$f":"I4","v":82.34},"OK",23.84,23.84,"OK",{"$f":"K4+L4","v":82.34},34.270000000000003,{"$f":"N4+O4","v":82.34},34.520000000000003,{"$f":"Q4+R4","v":82.34},32.130000000000003,{"$f":"T4+U4","v":82.34},36.75,{"$f":"W4+X4","v":82.34},43.36,{"$f":"+Z4+AA4","v":82.34},46.66,82.34,49.14,null,0,-2.3900000000000006,0,4.6199999999999974,0,6.6099999999999994,0,3.2999999999999972,0,2.480000000000004]
["HE04","1. Hidroelektrarne",null,"velika - nad 10MW do vključno 125MW","HE04",76.569999999999993,0,76.569999999999993,76.569999999999993,"OK",76.569999999999993,0,76.569999999999993,76.569999999999993,0,76.569999999999993,76.569999999999993,0,76.569999999999993,76.569999999999993,0,76.569999999999993,76.569999999999993,0,76.569999999999993,76.569999999999993,0,76.569999999999993,76.569999999999993,0,76.569999999999993,0.9,"(ni ZO)","(ni ZO)","OK",18.07,18.07,"OK","(ni ZO)",28.5,"(ni ZO)",28.75,"(ni ZO)",26.36,"(ni ZO)",30.98,"(ni ZO)",37.590000000000003,"(ni ZO)",40.89,"(ni ZO)",43.37,null,"(ni ZO)",-2.3900000000000006,"(ni ZO)",4.620000000000001,"(ni ZO)",6.610000000000003,"(ni ZO)",3.2999999999999972,"(ni ZO)",2.4799999999999969]
["VE01","2. Vetrne elektrarne","2. Vetrne elektrarne","mikro - manjše od 50kW","VE01",95.38,0,95.38,95.38,"OK",95.38,0,95.38,95.38,0,95.38,95.38,0,95.38,95.38,0,95.38,95.38,0,95.38,95.38,0,95.38,95.38,0,95.38,0.8,95.38,{"$f":"I6","v":95.38},"OK",43.38,43.38,"OK",{"$f":"K6+L6","v":95.38},52.65,{"$f":"N6+O6","v":95.38},52.88,{"$f":"Q6+R6","v":95.38},50.75,{"$f":"T6+U6","v":95.38},54.85,{"$f":"W6+X6","v":95.38},60.73,{"$f":"+Z6+AA6","v":95.38},63.66,95.38,65.87,null,0,-2.1300000000000026,{"$f":"AS6-AQ6","v":0},4.1000000000000014,{"$f":"AU6-AS6","v":0},5.8799999999999955,0,2.9299999999999997,0,2.210000000000008]
["VE02","2. Vetrne elektrarne",null,"mala - manjše od 1MW","VE02",95.38,0,95.38,95.38,"OK",95.38,0,95.38,95.38,0,95.38,95.38,0,95.38,95.38,0,95.38,95.38,0,95.38,95.38,0,95.38,95.38,0,95.38,0.8,95.38,{"$f":"I7","v":95.38},"OK",43.38,43.38,"OK",{"$f":"K7+L7","v":95.38},52.65,{"$f":"N7+O7","v":95.38},52.88,{"$f":"Q7+R7","v":95.38},50.75,{"$f":"T7+U7","v":95.38},54.85,{"$f":"W7+X7","v":95.38},60.73,{"$f":"+Z7+AA7","v":95.38},63.66,95.38,65.87,null,0,-2.1300000000000026,0,4.1000000000000014,0,5.8799999999999955,0,2.9299999999999997,0,2.210000000000008]
["VE03","2. Vetrne elektrarne",null,"srednja - od 1MW do vključno 10MW ","VE03",95.38,0,95.38,95.38,"OK",95.38,0,95.38,95.38,0,95.38,95.38,0,95.38,95.38,0,95.38,95.38,0,95.38,95.38,0,95.38,95.38,0,95.38,0.8,95.38,{"$f":"I8","v":95.38},"OK",43.38,43.38,"OK",{"$f":"K8+L8","v":95.38},52.65,{"$f":"N8+O8","v":95.38},52.88,{"$f":"Q8+R8","v":95.38},50.75,{"$f":"T8+U8","v":95.38},54.85,{"$f":"W8+X8","v":95.38},60.73,{"$f":"+Z8+AA8","v":95.38},63.66,95.38,65.87,null,0,-2.1300000000000026,0,4.1000000000000014,0,5.8799999999999955,0,2.9299999999999997,0,2.210000000000008]
["VE04","2. Vetrne elektrarne",null,"velika - nad 10MW do vključno 125MW","VE04",86.74,0,86.74,86.74,"OK",86.74,0,86.74,86.74,0,86.74,86.74,0,86.74,86.74,0,86.74,86.74,0,86.74,86.74,0,86.74,86.74,0,86.74,0.86,"(ni ZO)","(ni ZO)","OK",30.84,30.84,"OK","(ni ZO)",40.81,"(ni ZO)",41.05,"(ni ZO)",38.76,"(ni ZO)",43.17,"(ni ZO)",49.49,"(ni ZO)",52.64,"(ni ZO)",55.01,null,"(ni ZO)",-2.2899999999999991,"(ni ZO)",4.4100000000000037,"(ni ZO)",6.32,"(ni ZO)",3.1499999999999986,"(ni ZO)",2.3699999999999974]
["SE11-2009","3.1 Sončne elektrarne - na stavbah 2009","3.1 Sončne elektrarne - na stavbah 2009","mikro - manjše od 50kW","SE11",415.46,0,415.46,415.46,"OK",415.46,0,415.46,415.46,0,415.46,415.46,0,415.46,415.46,0,415.46,415.46,0,415.46,415.46,0,415.46,415.46,0,415.46,0.88,415.46,{"$f":"I10","v":415.46},"OK",358.26,358.26,"OK",{"$f":"K10+L10","v":415.46},368.46,{"$f":"N10+O10","v":415.46},368.71,{"$f":"Q10+R10","v":415.46},366.36,{"$f":"T10+U10","v":415.46},370.88,{"$f":"W10+X10","v":415.46},377.35,{"$f":"+Z10+AA10","v":415.46},380.57,415.46,383,null,0,-2.3499999999999659,{"$f":"AS10-AQ10","v":0},4.5199999999999818,{"$f":"AU10-AS10","v":0},6.4700000000000273,0,3.2199999999999704,0,2.4300000000000068]
["SE12-2009","3.1 Sončne elektrarne - na stavbah 2009",null,"mala - manjše od 1MW","SE12",380.02,0,380.02,380.02,"OK",380.02,0,380.02,{"$f":"F11","v":380.02},0,380.02,380.02,0,380.02,{"$f":"F11","v":380.02},0,380.02,380.02,0,380.02,380.02,0,380.02,380.02,0,380.02,0.88,380.02,{"$f":"I11","v":380.02},"OK",322.82,322.82,"OK",{"$f":"K11+L11","v":380.02},333.02,{"$f":"N11+O11","v":380.02},333.27,{"$f":"Q11+R11","v":380.02},330.92,{"$f":"T11+U11","v":380.02},335.44,{"$f":"W11+X11","v":380.02},341.91,{"$f":"+Z11+AA11","v":380.02},345.13,380.02,347.56,"le za INTEGRIRANE - razlika pri ZO in OP 2009 zaradi zaokrožitve +15%",0,-2.3499999999999659,0,4.5199999999999818,0,6.4700000000000273,0,3.2199999999999704,0,2.4300000000000068]
["SE13-2009","3.1 Sončne elektrarne - na stavbah 2009",null,"srednja - od 1MW do vključno 10MW ","SE13",315.36,0,315.36,315.36,"OK",315.36,0,315.36,315.36,0,315.36,315.36,0,315.36,315.36,0,315.36,315.36,0,315.36,315.36,0,315.36,315.36,0,315.36,0.91,315.36,{"$f":"I12","v":315.36},"OK",256.20999999999998,256.20999999999998,"OK",{"$f":"K12+L12","v":315.36},266.76,{"$f":"N12+O12","v":315.36},267.01,{"$f":"Q12+R12","v":315.36},264.58999999999997,{"$f":"T12+U12","v":315.36},269.26,{"$f":"W12+X12","v":315.36},275.95,{"$f":"+Z12+AA12","v":315.36},279.27999999999997,315.36,281.79000000000002,"le za INTEGRIRANE - razlika pri ZO in OP 2009 zaradi zaokrožitve +15%",0,-2.4200000000000159,0,4.6700000000000159,0,6.6899999999999977,0,3.3299999999999841,0,2.5100000000000477]
["SE14-2009","3.1 Sončne elektrarne - na stavbah 2009",null,"velika - nad 10MW do vključno 125MW","SE14",280.70999999999998,0,280.70999999999998,280.70999999999998,"OK",280.70999999999998,0,280.70999999999998,280.70999999999998,0,280.70999999999998,280.70999999999998,0,280.70999999999998,280.70999999999998,0,280.70999999999998,280.70999999999998,0,280.70999999999998,280.70999999999998,0,280.70999999999998,280.70999999999998,0,280.70999999999998,1,"(ni ZO)","(ni ZO)","OK",215.71,215.71,"OK","(ni ZO)",227.3,"(ni ZO)",227.58,"(ni ZO)",224.92,"(ni ZO)",230.05,"(ni ZO)",237.4,"(ni ZO)",241.06,"(ni ZO)",243.82,null,"(ni ZO)",-2.660000000000025,"(ni ZO)",5.1300000000000239,"(ni ZO)",7.3499999999999943,"(ni ZO)",3.6599999999999966,"(ni ZO)",2.7599999999999909]
[null,null,"3.1. INT Sončne elektrarne - integrirane 2009","mikro - manjše od 50kW",null,{"$f":"ROUND(F10*1.15,2)","v":477.78},0,null,{"$f":"F14+G14","v":477.78},"niso v uredbi; ROUND(2009*1,15 ; 2)",477.78,0,477.78,477.78,0,477.78,477.78,0,477.78,477.78,0,477.78,477.78,0,477.78,477.78,0,477.78,477.78,0,477.78,0.88,477.78,{"$f":"I14","v":477.78},"OK",420.58,420.58,"OK",{"$f":"K14+L14","v":477.78},430.78,{"$f":"N14+O14","v":477.78},431.03,{"$f":"Q14+R14","v":477.78},428.68,{"$f":"T14+U14","v":477.78},433.2,{"$f":"W14+X14","v":477.78},439.67,{"$f":"+Z14+AA14","v":477.78},442.89,477.78,445.32,null,0,-2.3499999999999659,{"$f":"AS14-AQ14","v":0},4.5199999999999818,{"$f":"AU14-AS14","v":0},6.4700000000000273,0,3.2199999999999704,0,2.4300000000000068]
[null,null,null,"mala - manjše od 1MW",null,{"$f":"ROUND(F11*1.15,2)","v":437.02},0,null,{"$f":"F15+G15","v":437.02},"niso v uredbi; ROUND(2009*1,15 ; 2)",437.02,0,437.02,437.02,0,437.02,437.02,0,437.02,437.02,0,437.02,437.02,0,437.02,437.02,0,437.02,437.02,0,437.02,0.88,437.03,{"$f":"I15","v":437.02},"razlika",379.83,379.82,"razlika",{"$f":"K15+L15","v":437.02},390.02,{"$f":"N15+O15","v":437.02},390.27,{"$f":"Q15+R15","v":437.02},387.92,{"$f":"T15+U15","v":437.02},392.44,{"$f":"W15+X15","v":437.02},398.91,{"$f":"+Z15+AA15","v":437.02},402.13,437.02,404.56,"razlika pri ZO in OP 2009 zaradi zaokrožitve +15%",0,-2.3499999999999659,0,4.5199999999999818,0,6.4700000000000273,0,3.2199999999999704,0,2.4300000000000068]
[null,null,null,"srednja - od 1MW do vključno 10MW ",null,{"$f":"ROUND(F12*1.15,2)","v":362.66},0,null,362.66,"niso v uredbi; ROUND(2009*1,15 ; 2)",362.66,0,362.66,362.66,0,362.66,362.66,0,362.66,362.66,0,362.66,362.66,0,362.66,362.66,0,362.66,362.66,0,362.66,0.91,362.67,{"$f":"I16","v":362.66},"razlika",303.52,303.51,"razlika",{"$f":"K16+L16","v":362.66},314.06,{"$f":"N16+O16","v":362.66},314.31,{"$f":"Q16+R16","v":362.66},311.89,{"$f":"T16+U16","v":362.66},316.56,{"$f":"W16+X16","v":362.66},323.25,{"$f":"+Z16+AA16","v":362.66},326.58,362.66,329.09,"razlika pri ZO in OP 2009 zaradi zaokrožitve +15%",0,-2.4200000000000159,0,4.6700000000000159,0,6.6899999999999977,0,3.3299999999999841,0,2.5099999999999909]
[null,null,null,"velika - nad 10MW do vključno 125MW",null,{"$f":"ROUND(F13*1.15,2)","v":322.82},0,null,322.82,"niso v uredbi; ROUND(2009*1,15 ; 2)",322.82,0,322.82,322.82,0,322.82,322.82,0,322.82,322.82,0,322.82,322.82,0,322.82,322.82,0,322.82,322.82,0,322.82,1,"(ni ZO)","(ni ZO)","OK",257.82,257.82,"OK","(ni ZO)",269.41000000000003,"(ni ZO)",269.69,"(ni ZO)",267.02999999999997,"(ni ZO)",272.16000000000003,"(ni ZO)",279.51,"(ni ZO)",283.17,"(ni ZO)",285.93,null,"(ni ZO)",-2.660000000000025,"(ni ZO)",5.1300000000000523,"(ni ZO)",7.3499999999999659,"(ni ZO)",3.660000000000025,"(ni ZO)",2.7599999999999909]
["SE21-2009","3.2 Sončne elektrarne - samostojni objekti 2009","3.2 Sončne elektrarne - samostojni objekti 2009","mikro - manjše od 50kW","SE21",390.42,0,390.42,390.42,{"$f":"IF(H18=I18,\"OK\",\"razlika\")","v":"OK"},390.42,0,390.42,390.42,0,390.42,390.42,0,390.42,390.42,0,390.42,390.42,0,390.42,390.42,0,390.42,390.42,0,390.42,0.88,390.42,{"$f":"I18","v":390.42},"OK",333.22,333.22,"OK",{"$f":"K18+L18","v":390.42},343.42,{"$f":"N18+O18","v":390.42},343.67,{"$f":"Q18+R18","v":390.42},341.32,{"$f":"T18+U18","v":390.42},345.84,{"$f":"W18+X18","v":390.42},352.31,{"$f":"+Z18+AA18","v":390.42},355.53,390.42,357.96,null,0,-2.3500000000000227,{"$f":"AS18-AQ18","v":0},4.5199999999999818,{"$f":"AU18-AS18","v":0},6.4700000000000273,0,3.2199999999999704,0,2.4300000000000068]
["SE22-2009","3.2 Sončne elektrarne - samostojni objekti 2009",null,"mala - manjše od 1MW","SE22",359.71,0,359.71,359.71,{"$f":"IF(H19=I19,\"OK\",\"razlika\")","v":"OK"},359.71,0,359.71,359.71,0,359.71,359.71,0,359.71,359.71,0,359.71,359.71,0,359.71,359.71,0,359.71,359.71,0,359.71,0.88,359.71,{"$f":"I19","v":359.71},"OK",302.51,302.51,"OK",{"$f":"K19+L19","v":359.71},312.70999999999998,{"$f":"N19+O19","v":359.71},312.95999999999998,{"$f":"Q19+R19","v":359.71},310.61,{"$f":"T19+U19","v":359.71},315.13,{"$f":"W19+X19","v":359.71},321.60000000000002,{"$f":"+Z19+AA19","v":359.71},324.82,359.71,327.25,null,0,-2.3499999999999659,0,4.5199999999999818,0,6.4700000000000273,0,3.2199999999999704,0,2.4300000000000068]
["SE23-2009","3.2 Sončne elektrarne - samostojni objekti 2009",null,"srednja - od 1MW do vključno 10MW ","SE23",289.98,0,289.98,289.98,{"$f":"IF(H20=I20,\"OK\",\"razlika\")","v":"OK"},289.98,0,289.98,289.98,0,289.98,289.98,0,289.98,289.98,0,289.98,289.98,0,289.98,289.98,0,289.98,289.98,0,289.98,0.91,289.98,{"$f":"I20","v":289.98},"OK",230.83,230.83,"OK",{"$f":"K20+L20","v":289.98},241.38,{"$f":"N20+O20","v":289.98},241.63,{"$f":"Q20+R20","v":289.98},239.21,{"$f":"T20+U20","v":289.98},243.88,{"$f":"W20+X20","v":289.98},250.57,{"$f":"+Z20+AA20","v":289.98},253.9,289.98,256.41000000000003,null,0,-2.4199999999999875,0,4.6699999999999875,0,6.6899999999999977,0,3.3300000000000125,0,2.5100000000000193]
["SE24-2009","3.2 Sončne elektrarne - samostojni objekti 2009",null,"velika - nad 10MW do vključno 125MW","SE24",269.22000000000003,0,269.22000000000003,269.22000000000003,{"$f":"IF(H21=I21,\"OK\",\"razlika\")","v":"OK"},269.22000000000003,0,269.22000000000003,269.22000000000003,0,269.22000000000003,269.22000000000003,0,269.22000000000003,269.22000000000003,0,269.22000000000003,269.22000000000003,0,269.22000000000003,269.22000000000003,0,269.22000000000003,269.22000000000003,0,269.22000000000003,1,"(ni ZO)","(ni ZO)","OK",204.22,204.22,"OK","(ni ZO)",215.81,"(ni ZO)",216.09,"(ni ZO)",213.43,"(ni ZO)",218.56,"(ni ZO)",225.91,"(ni ZO)",229.57,"(ni ZO)",232.33,null,"(ni ZO)",-2.6599999999999966,"(ni ZO)",5.1299999999999955,"(ni ZO)",7.3499999999999943,"(ni ZO)",3.6599999999999966,"(ni ZO)",2.7600000000000193]
["SE11-2010","3.1 Sončne elektrarne - na stavbah 2010","3.1 Sončne elektrarne - na stavbah 2010","mikro - manjše od 50kW","SE11",null,null,null,null,null,{"$f":"ROUND(F10*0.93,2)","v":386.38},0,386.38,{"$f":"K22","v":386.38},0,386.38,{"$f":"K22","v":386.38},0,386.38,{"$f":"K22","v":386.38},0,386.38,{"$f":"K22","v":386.38},0,386.38,386.38,0,386.38,386.38,0,386.38,0.88,null,null,null,null,null,null,{"$f":"K22+L22","v":386.38},339.38,{"$f":"N22+O22","v":386.38},339.63,{"$f":"Q22+R22","v":386.38},337.28,{"$f":"T22+U22","v":386.38},341.8,{"$f":"W22+X22","v":386.38},348.27,{"$f":"+Z22+AA22","v":386.38},351.49,386.38,353.92,null,0,-2.3500000000000227,{"$f":"AS22-AQ22","v":0},4.5200000000000387,{"$f":"AU22-AS22","v":0},6.4699999999999704,0,3.2200000000000273,0,2.4300000000000068]
["SE12-2010","3.1 Sončne elektrarne - na stavbah 2010",null,"mala - manjše od 1MW","SE12",null,null,null,null,null,{"$f":"ROUND(F11*0.93,2)","v":353.42},0,353.42,{"$f":"K23","v":353.42},0,353.42,353.42,0,353.42,353.42,0,353.42,353.42,0,353.42,353.42,0,353.42,353.42,0,353.42,0.88,null,null,null,null,null,null,{"$f":"K23+L23","v":353.42},306.42,{"$f":"N23+O23","v":353.42},306.67,{"$f":"Q23+R23","v":353.42},304.32,{"$f":"T23+U23","v":353.42},308.83999999999997,{"$f":"W23+X23","v":353.42},315.31,{"$f":"+Z23+AA23","v":353.42},318.52999999999997,353.42,320.95999999999998,null,0,-2.3500000000000227,0,4.5199999999999818,0,6.4700000000000273,0,3.2199999999999704,0,2.4300000000000068]
["SE13-2010","3.1 Sončne elektrarne - na stavbah 2010",null,"srednja - od 1MW do vključno 10MW ","SE13",null,null,null,null,null,293.27999999999997,0,293.27999999999997,293.27999999999997,0,293.27999999999997,293.27999999999997,0,293.27999999999997,293.27999999999997,0,293.27999999999997,293.27999999999997,0,293.27999999999997,293.27999999999997,0,293.27999999999997,293.27999999999997,0,293.27999999999997,0.91,null,null,null,null,null,null,{"$f":"K24+L24","v":293.27999999999997},244.68,{"$f":"N24+O24","v":293.27999999999997},244.93,{"$f":"Q24+R24","v":293.27999999999997},242.51,{"$f":"T24+U24","v":293.27999999999997},247.18,{"$f":"W24+X24","v":293.27999999999997},253.87,{"$f":"+Z24+AA24","v":293.27999999999997},257.2,293.27999999999997,259.70999999999998,null,0,-2.4200000000000159,0,4.6700000000000159,0,6.6899999999999977,0,3.3299999999999841,0,2.5099999999999909]
["SE14-2010","3.1 Sončne elektrarne - na stavbah 2010",null,"velika - nad 10MW do vključno 125MW","SE14",null,null,null,null,null,261.06,0,261.06,261.06,0,261.06,261.06,0,261.06,261.06,0,261.06,261.06,0,261.06,261.06,0,261.06,261.06,0,261.06,1,null,null,null,null,null,null,"(ni ZO)",207.65,"(ni ZO)",207.93,"(ni ZO)",205.27,"(ni ZO)",210.4,"(ni ZO)",217.75,"(ni ZO)",221.41,"(ni ZO)",224.17,null,"(ni ZO)",-2.6599999999999966,"(ni ZO)",5.1299999999999955,"(ni ZO)",7.3499999999999943,"(ni ZO)",3.6599999999999966,"(ni ZO)",2.7599999999999909]
[null,null,"3.1 INT Sončne elektrarne - integrirane 2010","mikro - manjše od 50kW",null,null,null,null,null,null,{"$f":"ROUND(K22*1.15,2)","v":444.34},0,444.34,444.34,0,444.34,444.34,0,444.34,444.34,0,444.34,444.34,0,444.34,444.34,0,444.34,444.34,0,444.34,0.88,null,null,null,null,null,null,{"$f":"K26+L26","v":444.34},397.34,{"$f":"N26+O26","v":444.34},397.59,{"$f":"Q26+R26","v":444.34},395.24,{"$f":"T26+U26","v":444.34},399.76,{"$f":"W26+X26","v":444.34},406.23,{"$f":"+Z26+AA26","v":444.34},409.45,444.34,411.88,null,0,-2.3499999999999659,{"$f":"AS26-AQ26","v":0},4.5199999999999818,{"$f":"AU26-AS26","v":0},6.4700000000000273,0,3.2199999999999704,0,2.4300000000000068]
[null,null,null,"mala - manjše od 1MW",null,null,null,null,null,null,{"$f":"ROUND(K23*1.15,2)","v":406.43},0,406.43,406.43,0,406.43,406.43,0,406.43,406.43,0,406.43,406.43,0,406.43,406.43,0,406.43,406.43,0,406.43,0.88,null,null,null,null,null,null,{"$f":"K27+L27","v":406.43},359.43,{"$f":"N27+O27","v":406.43},359.68,{"$f":"Q27+R27","v":406.43},357.33,{"$f":"T27+U27","v":406.43},361.85,{"$f":"W27+X27","v":406.43},368.32,{"$f":"+Z27+AA27","v":406.43},371.54,406.43,373.97,null,0,-2.3500000000000227,0,4.5200000000000387,0,6.4699999999999704,0,3.2200000000000273,0,2.4300000000000068]
[null,null,null,"srednja - od 1MW do vključno 10MW ",null,null,null,null,null,null,337.27,0,337.27,337.27,0,337.27,337.27,0,337.27,337.27,0,337.27,337.27,0,337.27,337.27,0,337.27,337.27,0,337.27,0.91,null,null,null,null,null,null,{"$f":"K28+L28","v":337.27},288.67,{"$f":"N28+O28","v":337.27},288.92,{"$f":"Q28+R28","v":337.27},286.5,{"$f":"T28+U28","v":337.27},291.17,{"$f":"W28+X28","v":337.27},297.86,{"$f":"+Z28+AA28","v":337.27},301.19,337.27,303.7,null,0,-2.4200000000000159,0,4.6700000000000159,0,6.6899999999999977,0,3.3299999999999841,0,2.5099999999999909]
[null,null,null,"velika - nad 10MW do vključno 125MW",null,null,null,null,null,null,300.22000000000003,0,300.22000000000003,300.22000000000003,0,300.22000000000003,300.22000000000003,0,300.22000000000003,300.22000000000003,0,300.22000000000003,300.22000000000003,0,300.22000000000003,300.22000000000003,0,300.22000000000003,300.22000000000003,0,300.22000000000003,1,null,null,null,null,null,null,"(ni ZO)",246.81,"(ni ZO)",247.09,"(ni ZO)",244.43,"(ni ZO)",249.56,"(ni ZO)",256.91000000000003,"(ni ZO)",260.57,"(ni ZO)",263.33,null,"(ni ZO)",-2.6599999999999966,"(ni ZO)",5.1299999999999955,"(ni ZO)",7.3500000000000227,"(ni ZO)",3.6599999999999682,"(ni ZO)",2.7599999999999909]
["SE21-2010","3.2 Sončne elektrarne - samostojni objekti 2010","3.2 Sončne elektrarne - samostojni objekti 2010","mikro - manjše od 50kW","SE21",null,null,null,null,null,363.09,0,363.09,363.09,0,363.09,363.09,0,363.09,363.09,0,363.09,363.09,0,363.09,363.09,0,363.09,363.09,0,363.09,0.88,null,null,null,null,null,null,{"$f":"K30+L30","v":363.09},316.08999999999997,{"$f":"N30+O30","v":363.09},316.33999999999997,{"$f":"Q30+R30","v":363.09},313.99,{"$f":"T30+U30","v":363.09},318.51,{"$f":"W30+X30","v":363.09},324.98,{"$f":"+Z30+AA30","v":363.09},328.2,363.09,330.63,null,0,-2.3499999999999659,{"$f":"AS30-AQ30","v":0},4.5199999999999818,{"$f":"AU30-AS30","v":0},6.4700000000000273,0,3.2199999999999704,0,2.4300000000000068]
["SE22-2010","3.2 Sončne elektrarne - samostojni objekti 2010",null,"mala - manjše od 1MW","SE22",null,null,null,null,null,334.53,0,334.53,334.53,0,334.53,334.53,0,334.53,334.53,0,334.53,334.53,0,334.53,334.53,0,334.53,334.53,0,334.53,0.88,null,null,null,null,null,null,{"$f":"K31+L31","v":334.53},287.52999999999997,{"$f":"N31+O31","v":334.53},287.77999999999997,{"$f":"Q31+R31","v":334.53},285.43,{"$f":"T31+U31","v":334.53},289.95,{"$f":"W31+X31","v":334.53},296.42,{"$f":"+Z31+AA31","v":334.53},299.64,334.53,302.07,null,0,-2.3499999999999659,0,4.5199999999999818,0,6.4700000000000273,0,3.2199999999999704,0,2.4300000000000068]
["SE23-2010","3.2 Sončne elektrarne - samostojni objekti 2010",null,"srednja - od 1MW do vključno 10MW ","SE23",null,null,null,null,null,269.68,0,269.68,269.68,0,269.68,269.68,0,269.68,269.68,0,269.68,269.68,0,269.68,269.68,0,269.68,269.68,0,269.68,0.91,null,null,null,null,null,null,{"$f":"K32+L32","v":269.68},221.08,{"$f":"N32+O32","v":269.68},221.33,{"$f":"Q32+R32","v":269.68},218.91,{"$f":"T32+U32","v":269.68},223.58,{"$f":"W32+X32","v":269.68},230.27,{"$f":"+Z32+AA32","v":269.68},233.6,269.68,236.11,null,0,-2.4200000000000159,0,4.6700000000000159,0,6.6899999999999977,0,3.3299999999999841,0,2.5100000000000193]
["SE24-2010","3.2 Sončne elektrarne - samostojni objekti 2010",null,"velika - nad 10MW do vključno 125MW","SE24",null,null,null,null,null,250.37,0,250.37,250.37,0,250.37,250.37,0,250.37,{"$f":"K33","v":250.37},0,250.37,{"$f":"K33","v":250.37},0,250.37,250.37,0,250.37,250.37,0,250.37,1,null,null,null,null,null,null,"(ni ZO)",196.96,"(ni ZO)",197.24,"(ni ZO)",194.58,"(ni ZO)",199.71,"(ni ZO)",207.06,"(ni ZO)",210.72,"(ni ZO)",213.48,null,"(ni ZO)",-2.6599999999999966,"(ni ZO)",5.1299999999999955,"(ni ZO)",7.3499999999999943,"(ni ZO)",3.6599999999999966,"(ni ZO)",2.7599999999999909]
["SE11-2011","3.1 Sončne elektrarne - na stavbah 2011","3.1 Sončne elektrarne - na stavbah 2011","mikro - manjše od 50kW","SE11",null,null,null,null,null,null,null,null,{"$f":"ROUND(F10*0.8,2)","v":332.37},0,332.37,{"$f":"N34","v":332.37},0,332.37,{"$f":"N34","v":332.37},0,332.37,{"$f":"N34","v":332.37},0,332.37,332.37,0,332.37,332.37,0,332.37,0.88,null,null,null,null,null,null,null,null,{"$f":"N34+O34","v":332.37},285.62,{"$f":"Q34+R34","v":332.37},{"$f":"ROUND((Q34+R34)-AF34*$I$326,2)","v":283.27},{"$f":"T34+U34","v":332.37},{"$f":"ROUND((T34+U34)-AF34*$H$326,2)","v":287.79000000000002},{"$f":"W34+X34","v":332.37},294.26,{"$f":"+Z34+AA34","v":332.37},297.48,332.37,299.91000000000003,null,0,-2.3500000000000227,{"$f":"AS34-AQ34","v":0},4.5200000000000387,{"$f":"AU34-AS34","v":0},6.4699999999999704,0,3.2200000000000273,0,2.4300000000000068]
["SE12-2011","3.1 Sončne elektrarne - na stavbah 2011",null,"mala - manjše od 1MW","SE12",null,null,null,null,null,null,null,null,304.02,0,304.02,{"$f":"N35","v":304.02},0,304.02,304.02,0,304.02,304.02,0,304.02,304.02,0,304.02,304.02,0,304.02,0.88,null,null,null,null,null,null,null,null,{"$f":"N35+O35","v":304.02},257.27,{"$f":"Q35+R35","v":304.02},254.92,{"$f":"T35+U35","v":304.02},259.44,{"$f":"W35+X35","v":304.02},265.91000000000003,{"$f":"+Z35+AA35","v":304.02},269.13,304.02,271.56,null,0,-2.3499999999999943,0,4.5200000000000102,0,6.4700000000000273,0,3.2199999999999704,0,2.4300000000000068]
["SE13-2011","3.1 Sončne elektrarne - na stavbah 2011",null,"srednja - od 1MW do vključno 10MW ","SE13",null,null,null,null,null,null,null,null,252.29,0,252.29,252.29,0,252.29,252.29,0,252.29,252.29,0,252.29,252.29,0,252.29,252.29,0,252.29,0.91,null,null,null,null,null,null,null,null,{"$f":"N36+O36","v":252.29},203.94,{"$f":"Q36+R36","v":252.29},201.52,{"$f":"T36+U36","v":252.29},206.19,{"$f":"W36+X36","v":252.29},212.88,{"$f":"+Z36+AA36","v":252.29},216.21,252.29,218.72,null,0,-2.4199999999999875,0,4.6699999999999875,0,6.6899999999999977,0,3.3300000000000125,0,2.5099999999999909]
["SE14-2011","3.1 Sončne elektrarne - na stavbah 2011",null,"velika - nad 10MW do vključno 125MW","SE14",null,null,null,null,null,null,null,null,224.57,0,224.57,224.57,0,224.57,224.57,0,224.57,224.57,0,224.57,224.57,0,224.57,224.57,0,224.57,1,null,null,null,null,null,null,null,null,"(ni ZO)",171.44,"(ni ZO)",168.78,"(ni ZO)",173.91,"(ni ZO)",181.26,"(ni ZO)",184.92,"(ni ZO)",187.68,null,"(ni ZO)",-2.6599999999999966,"(ni ZO)",5.1299999999999955,"(ni ZO)",7.3499999999999943,"(ni ZO)",3.6599999999999966,"(ni ZO)",2.7600000000000193]
[null,null,"3.1 INT Sončne elektrarne - integrirane 2011","mikro - manjše od 50kW",null,null,null,null,null,null,null,null,null,{"$f":"ROUND(N34*1.15,2)","v":382.23},0,382.23,382.23,0,382.23,382.23,0,382.23,382.23,0,382.23,382.23,0,382.23,382.23,0,382.23,0.88,null,null,null,null,null,null,null,null,{"$f":"N38+O38","v":382.23},335.48,{"$f":"Q38+R38","v":382.23},333.13,{"$f":"T38+U38","v":382.23},337.65,{"$f":"W38+X38","v":382.23},344.12,{"$f":"+Z38+AA38","v":382.23},347.34,382.23,349.77,null,0,-2.3500000000000227,{"$f":"AS38-AQ38","v":0},4.5199999999999818,{"$f":"AU38-AS38","v":0},6.4700000000000273,0,3.2199999999999704,0,2.4300000000000068]
[null,null,null,"mala - manjše od 1MW",null,null,null,null,null,null,null,null,null,{"$f":"ROUND(N35*1.15,2)","v":349.62},0,349.62,349.62,0,349.62,349.62,0,349.62,349.62,0,349.62,349.62,0,349.62,349.62,0,349.62,0.88,null,null,null,null,null,null,null,null,{"$f":"N39+O39","v":349.62},302.87,{"$f":"Q39+R39","v":349.62},300.52,{"$f":"T39+U39","v":349.62},305.04000000000002,{"$f":"W39+X39","v":349.62},311.51,{"$f":"+Z39+AA39","v":349.62},314.73,349.62,317.16000000000003,null,0,-2.3500000000000227,0,4.5200000000000387,0,6.4699999999999704,0,3.2200000000000273,0,2.4300000000000068]
[null,null,null,"srednja - od 1MW do vključno 10MW ",null,null,null,null,null,null,null,null,null,290.13,0,290.13,290.13,0,290.13,290.13,0,290.13,290.13,0,290.13,290.13,0,290.13,290.13,0,290.13,0.91,null,null,null,null,null,null,null,null,{"$f":"N40+O40","v":290.13},241.78,{"$f":"Q40+R40","v":290.13},239.36,{"$f":"T40+U40","v":290.13},244.03,{"$f":"W40+X40","v":290.13},250.72,{"$f":"+Z40+AA40","v":290.13},254.05,290.13,256.56,null,0,-2.4199999999999875,0,4.6699999999999875,0,6.6899999999999977,0,3.3300000000000125,0,2.5099999999999909]
[null,null,null,"velika - nad 10MW do vključno 125MW",null,null,null,null,null,null,null,null,null,258.26,0,258.26,258.26,0,258.26,258.26,0,258.26,258.26,0,258.26,258.26,0,258.26,258.26,0,258.26,1,null,null,null,null,null,null,null,null,"(ni ZO)",205.13,"(ni ZO)",202.47,"(ni ZO)",207.6,"(ni ZO)",214.95,"(ni ZO)",218.61,"(ni ZO)",221.37,null,"(ni ZO)",-2.6599999999999966,"(ni ZO)",5.1299999999999955,"(ni ZO)",7.3499999999999943,"(ni ZO)",3.660000000000025,"(ni ZO)",2.7599999999999909]
["SE21-2011","3.2 Sončne elektrarne - samostojni objekti 2011","3.2 Sončne elektrarne - samostojni objekti 2011","mikro - manjše od 50kW","SE21",null,null,null,null,null,null,null,null,312.33999999999997,0,312.33999999999997,312.33999999999997,0,312.33999999999997,312.33999999999997,0,312.33999999999997,312.33999999999997,0,312.33999999999997,312.33999999999997,0,312.33999999999997,312.33999999999997,0,312.33999999999997,0.88,null,null,null,null,null,null,null,null,{"$f":"N42+O42","v":312.33999999999997},265.58999999999997,{"$f":"Q42+R42","v":312.33999999999997},263.24,{"$f":"T42+U42","v":312.33999999999997},267.76,{"$f":"W42+X42","v":312.33999999999997},274.23,{"$f":"+Z42+AA42","v":312.33999999999997},277.45,312.33999999999997,279.88,null,0,-2.3499999999999659,{"$f":"AS42-AQ42","v":0},4.5199999999999818,{"$f":"AU42-AS42","v":0},6.4700000000000273,0,3.2199999999999704,0,2.4300000000000068]
["SE22-2011","3.2 Sončne elektrarne - samostojni objekti 2011",null,"mala - manjše od 1MW","SE22",null,null,null,null,null,null,null,null,287.77,0,287.77,287.77,0,287.77,287.77,0,287.77,287.77,0,287.77,287.77,0,287.77,287.77,0,287.77,0.88,null,null,null,null,null,null,null,null,{"$f":"N43+O43","v":287.77},241.02,{"$f":"Q43+R43","v":287.77},238.67,{"$f":"T43+U43","v":287.77},243.19,{"$f":"W43+X43","v":287.77},249.66,{"$f":"+Z43+AA43","v":287.77},252.88,287.77,255.31,null,0,-2.3500000000000227,0,4.5200000000000102,0,6.4699999999999989,0,3.2199999999999989,0,2.4300000000000068]
["SE23-2011","3.2 Sončne elektrarne - samostojni objekti 2011",null,"srednja - od 1MW do vključno 10MW ","SE23",null,null,null,null,null,null,null,null,231.98,0,231.98,231.98,0,231.98,231.98,0,231.98,231.98,0,231.98,231.98,0,231.98,231.98,0,231.98,0.91,null,null,null,null,null,null,null,null,{"$f":"N44+O44","v":231.98},183.63,{"$f":"Q44+R44","v":231.98},181.21,{"$f":"T44+U44","v":231.98},185.88,{"$f":"W44+X44","v":231.98},192.57,{"$f":"+Z44+AA44","v":231.98},195.9,231.98,198.41,null,0,-2.4199999999999875,0,4.6699999999999875,0,6.6899999999999977,0,3.3300000000000125,0,2.5099999999999909]
["SE24-2011","3.2 Sončne elektrarne - samostojni objekti 2011",null,"velika - nad 10MW do vključno 125MW","SE24",null,null,null,null,null,null,null,null,215.38,0,215.38,215.38,0,215.38,{"$f":"N45","v":215.38},0,215.38,{"$f":"N45","v":215.38},0,215.38,215.38,0,215.38,215.38,0,215.38,1,null,null,null,null,null,null,null,null,"(ni ZO)",162.25,"(ni ZO)",159.59,"(ni ZO)",164.72,"(ni ZO)",172.07,"(ni ZO)",175.73,"(ni ZO)",178.49,null,"(ni ZO)",-2.6599999999999966,"(ni ZO)",5.1299999999999955,"(ni ZO)",7.3499999999999943,"(ni ZO)",3.6599999999999966,"(ni ZO)",2.7600000000000193]
["SE11-2012H1","3.1 Sončne elektrarne - na stavbah 2012 - prva polovica","3.1 Sončne elektrarne - na stavbah 2012 H1","mikro - manjše od 50kW","SE11",null,null,null,null,null,null,null,null,null,null,null,{"$f":"ROUND(F10*0.7,2)","v":290.82},0,{"$f":"Q46+R46","v":290.82},{"$f":"Q46","v":290.82},0,290.82,{"$f":"Q46","v":290.82},0,290.82,290.82,0,290.82,290.82,0,290.82,0.88,null,null,null,null,null,null,null,null,null,null,{"$f":"Q46+R46","v":290.82},241.72,{"$f":"T46+U46","v":290.82},246.24,{"$f":"W46+X46","v":290.82},252.71,{"$f":"+Z46+AA46","v":290.82},255.93,290.82,258.36,null,"(ni podpore 2011)","(ni podpore 2011)",{"$f":"AS46-AQ46","v":0},{"$f":"AT46-AR46","v":4.5200000000000102},{"$f":"AU46-AS46","v":0},6.4699999999999989,0,3.2199999999999989,0,2.4300000000000068]
["SE12-2012H1","3.1 Sončne elektrarne - na stavbah 2012 - prva polovica",null,"mala - manjše od 1MW","SE12",null,null,null,null,null,null,null,null,null,null,null,{"$f":"ROUND(F11*0.7,2)","v":266.01},0,266.01,{"$f":"Q47","v":266.01},0,266.01,{"$f":"Q47","v":266.01},0,266.01,266.01,0,266.01,266.01,0,266.01,0.88,null,null,null,null,null,null,null,null,null,null,{"$f":"Q47+R47","v":266.01},216.91,{"$f":"T47+U47","v":266.01},221.43,{"$f":"W47+X47","v":266.01},227.9,{"$f":"+Z47+AA47","v":266.01},231.12,266.01,233.55,null,"(ni podpore 2011)","(ni podpore 2011)",0,4.5200000000000102,0,6.4699999999999989,0,3.2199999999999989,0,2.4300000000000068]
["SE13-2012H1","3.1 Sončne elektrarne - na stavbah 2012 - prva polovica",null,"srednja - od 1MW do vključno 10MW ","SE13",null,null,null,null,null,null,null,null,null,null,null,{"$f":"ROUND(F12*0.7,2)","v":220.75},0,220.75,220.75,0,220.75,220.75,0,220.75,220.75,0,220.75,220.75,0,220.75,0.91,null,null,null,null,null,null,null,null,null,null,{"$f":"Q48+R48","v":220.75},169.98,{"$f":"T48+U48","v":220.75},174.65,{"$f":"W48+X48","v":220.75},181.34,{"$f":"+Z48+AA48","v":220.75},184.67,220.75,187.18,null,"(ni podpore 2011)","(ni podpore 2011)",0,4.6700000000000159,0,6.6899999999999977,0,3.3299999999999841,0,2.5100000000000193]
["SE14-2012H1","3.1 Sončne elektrarne - na stavbah 2012 - prva polovica",null,"velika - nad 10MW do vključno 125MW","SE14",null,null,null,null,null,null,null,null,null,null,null,{"$f":"ROUND(F13*0.7,2)","v":196.5},0,196.5,196.5,0,196.5,196.5,0,196.5,196.5,0,196.5,196.5,0,196.5,1,null,null,null,null,null,null,null,null,null,null,"(ni ZO)",140.71,"(ni ZO)",145.84,"(ni ZO)",153.19,"(ni ZO)",156.85,"(ni ZO)",159.61000000000001,null,"(ni podpore 2011)","(ni podpore 2011)","(ni ZO)",5.1299999999999955,"(ni ZO)",7.3499999999999943,"(ni ZO)",3.6599999999999966,"(ni ZO)",2.7600000000000193]
["SE11-2012H2","3.1 Sončne elektrarne - na stavbah 2012 - druga polovica","3.1 Sončne elektrarne - na stavbah 2012 H2","mikro - manjše od 50kW","SE11",null,null,null,null,null,null,null,null,null,null,null,{"$f":"ROUND(F10*0.4755,2)","v":197.55},0,{"$f":"Q50+R50","v":197.55},197.55,0,197.55,197.55,0,197.55,197.55,0,197.55,197.55,0,197.55,0.88,null,null,null,null,null,null,null,null,null,null,{"$f":"Q50+R50","v":197.55},148.44999999999999,{"$f":"T50+U50","v":197.55},152.97,{"$f":"W50+X50","v":197.55},159.44,{"$f":"+Z50+AA50","v":197.55},162.66,197.55,165.09,null,"(ni podpore 2011)","(ni podpore 2011)",0,4.5200000000000102,{"$f":"AU50-AS50","v":0},6.4699999999999989,0,3.2199999999999989,0,2.4300000000000068]
["SE12-2012H2","3.1 Sončne elektrarne - na stavbah 2012 - druga polovica",null,"mala - manjše od 1MW","SE12",null,null,null,null,null,null,null,null,null,null,null,{"$f":"ROUND(F11*0.4755,2)","v":180.7},0,180.7,180.7,0,180.7,180.7,0,180.7,180.7,0,180.7,180.7,0,180.7,0.88,null,null,null,null,null,null,null,null,null,null,{"$f":"Q51+R51","v":180.7},131.6,{"$f":"T51+U51","v":180.7},136.12,{"$f":"W51+X51","v":180.7},142.59,{"$f":"+Z51+AA51","v":180.7},145.81,180.7,148.24,null,"(ni podpore 2011)","(ni podpore 2011)",0,4.5200000000000102,0,6.4699999999999989,0,3.2199999999999989,0,2.4300000000000068]
["SE13-2012H2","3.1 Sončne elektrarne - na stavbah 2012 - druga polovica",null,"srednja - od 1MW do vključno 10MW ","SE13",null,null,null,null,null,null,null,null,null,null,null,{"$f":"ROUND(F12*0.4755,2)","v":149.94999999999999},0,149.94999999999999,149.94999999999999,0,149.94999999999999,149.94999999999999,0,149.94999999999999,149.94999999999999,0,149.94999999999999,149.94999999999999,0,149.94999999999999,0.91,null,null,null,null,null,null,null,null,null,null,{"$f":"Q52+R52","v":149.94999999999999},99.18,{"$f":"T52+U52","v":149.94999999999999},103.85,{"$f":"W52+X52","v":149.94999999999999},110.54,{"$f":"+Z52+AA52","v":149.94999999999999},113.87,149.94999999999999,116.38,null,"(ni podpore 2011)","(ni podpore 2011)",0,4.6699999999999875,0,6.6900000000000119,0,3.3299999999999983,0,2.5099999999999909]
["SE14-2012H2","3.1 Sončne elektrarne - na stavbah 2012 - druga polovica",null,"velika - nad 10MW do vključno 125MW","SE14",null,null,null,null,null,null,null,null,null,null,null,{"$f":"ROUND(F13*0.4755,2)","v":133.47999999999999},0,133.47999999999999,133.47999999999999,0,133.47999999999999,133.47999999999999,0,133.47999999999999,133.47999999999999,0,133.47999999999999,133.47999999999999,0,133.47999999999999,1,null,null,null,null,null,null,null,null,null,null,"(ni ZO)",77.69,"(ni ZO)",82.82,"(ni ZO)",90.17,"(ni ZO)",93.83,"(ni ZO)",96.59,null,"(ni podpore 2011)","(ni podpore 2011)","(ni ZO)",5.1299999999999955,"(ni ZO)",7.3500000000000085,"(ni ZO)",3.6599999999999966,"(ni ZO)",2.7600000000000051]
["SE21-2012H1","3.2 Sončne elektrarne - ostale 2012 - prva polovica","3.2 Sončne elektrarne - ostale 2012 H1","mikro - manjše od 50kW","SE21",null,null,null,null,null,null,null,null,null,null,null,{"$f":"ROUND(F18*0.7,2)","v":273.29000000000002},0,273.29000000000002,273.29000000000002,0,273.29000000000002,273.29000000000002,0,273.29000000000002,273.29000000000002,0,273.29000000000002,273.29000000000002,0,273.29000000000002,0.88,null,null,null,null,null,null,null,null,null,null,{"$f":"Q54+R54","v":273.29000000000002},224.19,{"$f":"T54+U54","v":273.29000000000002},228.71,{"$f":"W54+X54","v":273.29000000000002},235.18,{"$f":"+Z54+AA54","v":273.29000000000002},238.4,273.29000000000002,240.83,null,"(ni podpore 2011)","(ni podpore 2011)",0,4.5200000000000102,{"$f":"AU54-AS54","v":0},6.4699999999999989,0,3.2199999999999989,0,2.4300000000000068]
["SE22-2012H1","3.2 Sončne elektrarne - ostale 2012 - prva polovica",null,"mala - manjše od 1MW","SE22",null,null,null,null,null,null,null,null,null,null,null,{"$f":"ROUND(F19*0.7,2)","v":251.8},0,251.8,251.8,0,251.8,251.8,0,251.8,251.8,0,251.8,251.8,0,251.8,0.88,null,null,null,null,null,null,null,null,null,null,{"$f":"Q55+R55","v":251.8},202.7,{"$f":"T55+U55","v":251.8},207.22,{"$f":"W55+X55","v":251.8},213.69,{"$f":"+Z55+AA55","v":251.8},216.91,251.8,219.34,null,"(ni podpore 2011)","(ni podpore 2011)",0,4.5200000000000102,0,6.4699999999999989,0,3.2199999999999989,0,2.4300000000000068]
["SE23-2012H1","3.2 Sončne elektrarne - ostale 2012 - prva polovica",null,"srednja - od 1MW do vključno 10MW ","SE23",null,null,null,null,null,null,null,null,null,null,null,{"$f":"ROUND(F20*0.7,2)","v":202.99},0,202.99,202.99,0,202.99,202.99,0,202.99,202.99,0,202.99,202.99,0,202.99,0.91,null,null,null,null,null,null,null,null,null,null,{"$f":"Q56+R56","v":202.99},152.22,{"$f":"T56+U56","v":202.99},156.88999999999999,{"$f":"W56+X56","v":202.99},163.58000000000001,{"$f":"+Z56+AA56","v":202.99},166.91,202.99,169.42,null,"(ni podpore 2011)","(ni podpore 2011)",0,4.6699999999999875,0,6.6900000000000261,0,3.3299999999999841,0,2.5099999999999909]
["SE24-2012H1","3.2 Sončne elektrarne - ostale 2012 - prva polovica",null,"velika - nad 10MW do vključno 125MW","SE24",null,null,null,null,null,null,null,null,null,null,null,{"$f":"ROUND(F21*0.7,2)","v":188.45},0,188.45,188.45,0,188.45,188.45,0,188.45,188.45,0,188.45,188.45,0,188.45,1,null,null,null,null,null,null,null,null,null,null,"(ni ZO)",132.66,"(ni ZO)",137.79,"(ni ZO)",145.13999999999999,"(ni ZO)",148.80000000000001,"(ni ZO)",151.56,null,"(ni podpore 2011)","(ni podpore 2011)","(ni ZO)",5.1299999999999955,"(ni ZO)",7.3499999999999943,"(ni ZO)",3.660000000000025,"(ni ZO)",2.7599999999999909]
["SE21-2012H2","3.2 Sončne elektrarne - ostale 2012 - druga polovica","3.2 Sončne elektrarne - ostale 2012 H2","mikro - manjše od 50kW","SE21",null,null,null,null,null,null,null,null,null,null,null,{"$f":"ROUND(F18*0.4755,2)","v":185.64},0,{"$f":"Q58+R58","v":185.64},185.64,0,185.64,185.64,0,185.64,185.64,0,185.64,185.64,0,185.64,0.88,null,null,null,null,null,null,null,null,null,null,{"$f":"Q58+R58","v":185.64},136.54,{"$f":"T58+U58","v":185.64},141.06,{"$f":"W58+X58","v":185.64},147.53,{"$f":"+Z58+AA58","v":185.64},150.75,185.64,153.18,null,"(ni podpore 2011)","(ni podpore 2011)",0,4.5200000000000102,{"$f":"AU58-AS58","v":0},6.4699999999999989,0,3.2199999999999989,0,2.4300000000000068]
["SE22-2012H2","3.2 Sončne elektrarne - ostale 2012 - druga polovica",null,"mala - manjše od 1MW","SE22",null,null,null,null,null,null,null,null,null,null,null,{"$f":"ROUND(F19*0.4755,2)","v":171.04},0,171.04,171.04,0,171.04,171.04,0,171.04,171.04,0,171.04,171.04,0,171.04,0.88,null,null,null,null,null,null,null,null,null,null,{"$f":"Q59+R59","v":171.04},121.94,{"$f":"T59+U59","v":171.04},126.46,{"$f":"W59+X59","v":171.04},132.93,{"$f":"+Z59+AA59","v":171.04},136.15,171.04,138.58000000000001,null,"(ni podpore 2011)","(ni podpore 2011)",0,4.519999999999996,0,6.4700000000000131,0,3.2199999999999989,0,2.4300000000000068]
["SE23-2012H2","3.2 Sončne elektrarne - ostale 2012 - druga polovica",null,"srednja - od 1MW do vključno 10MW ","SE23",null,null,null,null,null,null,null,null,null,null,null,{"$f":"ROUND(F20*0.4755,2)","v":137.88999999999999},0,137.88999999999999,137.88999999999999,0,137.88999999999999,137.88999999999999,0,137.88999999999999,137.88999999999999,0,137.88999999999999,137.88999999999999,0,137.88999999999999,0.91,null,null,null,null,null,null,null,null,null,null,{"$f":"Q60+R60","v":137.88999999999999},87.12,{"$f":"T60+U60","v":137.88999999999999},91.79,{"$f":"W60+X60","v":137.88999999999999},98.48,{"$f":"+Z60+AA60","v":137.88999999999999},101.81,137.88999999999999,104.32,null,"(ni podpore 2011)","(ni podpore 2011)",0,4.6700000000000017,0,6.6899999999999977,0,3.3299999999999983,0,2.5099999999999909]
["SE24-2012H2","3.2 Sončne elektrarne - ostale 2012 - druga polovica",null,"velika - nad 10MW do vključno 125MW","SE24",null,null,null,null,null,null,null,null,null,null,null,{"$f":"ROUND(F21*0.4755,2)","v":128.01},0,128.01,128.01,0,128.01,128.01,0,128.01,128.01,0,128.01,128.01,0,128.01,1,null,null,null,null,null,null,null,null,null,null,"(ni ZO)",72.22,"(ni ZO)",77.349999999999994,"(ni ZO)",84.7,"(ni ZO)",88.36,"(ni ZO)",91.12,null,"(ni podpore 2011)","(ni podpore 2011)","(ni ZO)",5.1299999999999955,"(ni ZO)",7.3500000000000085,"(ni ZO)",3.6599999999999966,"(ni ZO)",2.7600000000000051]
["SE11-2012dec","3.1 Sončne elektrarne - na stavbah 2012 december",null,"mikro - manjše od 50kW","SE11",null,null,null,null,null,null,null,null,null,null,null,null,null,null,150,0,{"$f":"T62+U62","v":150},150,0,150,150,0,150,150,0,150,0.88,null,null,null,null,null,null,null,null,null,null,null,null,{"$f":"T62+U62","v":150},105.42,{"$f":"W62+X62","v":150},111.89,{"$f":"+Z62+AA62","v":150},115.11,150,117.54,null,"(ni podpore 2011/2)","(ni podpore 2011/2)","(ni podpore 2011/2)","(ni podpore 2011/2)",{"$f":"AU62-AS62","v":0},{"$f":"AV62-AT62","v":6.4699999999999989},0,3.2199999999999989,0,2.4300000000000068]
["SE12-2012dec","3.1 Sončne elektrarne - na stavbah 2012 december",null,"mala - manjše od 1MW","SE12",null,null,null,null,null,null,null,null,null,null,null,null,null,null,137.19,0,137.19,137.19,0,137.19,137.19,0,137.19,137.19,0,137.19,0.88,null,null,null,null,null,null,null,null,null,null,null,null,{"$f":"T63+U63","v":137.19},92.61,{"$f":"W63+X63","v":137.19},99.08,{"$f":"+Z63+AA63","v":137.19},102.3,137.19,104.73,null,"(ni podpore 2011/2)","(ni podpore 2011/2)","(ni podpore 2011/2)","(ni podpore 2011/2)",0,6.4699999999999989,0,3.2199999999999989,0,2.4300000000000068]
["SE13-2012dec","3.1 Sončne elektrarne - na stavbah 2012 december",null,"srednja - od 1MW do vključno 10MW ","SE13",null,null,null,null,null,null,null,null,null,null,null,null,null,null,113.85,0,113.85,113.85,0,113.85,113.85,0,113.85,113.85,0,113.85,0.91,null,null,null,null,null,null,null,null,null,null,null,null,{"$f":"T64+U64","v":113.85},67.75,{"$f":"W64+X64","v":113.85},74.44,{"$f":"+Z64+AA64","v":113.85},77.77,113.85,80.28,null,"(ni podpore 2011/2)","(ni podpore 2011/2)","(ni podpore 2011/2)","(ni podpore 2011/2)",0,6.6899999999999977,0,3.3299999999999983,0,2.5100000000000051]
["SE14-2012dec","3.1 Sončne elektrarne - na stavbah 2012 december",null,"velika - nad 10MW do vključno 125MW","SE14",null,null,null,null,null,null,null,null,null,null,null,null,null,null,101.34,0,101.34,101.34,0,101.34,101.34,0,101.34,101.34,0,101.34,1,null,null,null,null,null,null,null,null,null,null,null,null,"(ni ZO)",50.68,"(ni ZO)",58.03,"(ni ZO)",61.69,"(ni ZO)",64.45,null,"(ni podpore 2011/2)","(ni podpore 2011/2)","(ni podpore 2011/2)","(ni podpore 2011/2)","(ni ZO)",7.3500000000000014,"(ni ZO)",3.6599999999999966,"(ni ZO)",2.7600000000000051]
["SE21-2012dec","3.2 Sončne elektrarne - ostale 2012 december",null,"mikro - manjše od 50kW","SE21",null,null,null,null,null,null,null,null,null,null,null,null,null,null,140.94999999999999,0,140.94999999999999,140.94999999999999,0,140.94999999999999,{"$f":"+W66","v":140.94999999999999},{"$f":"+X66","v":0},{"$f":"+Z66+AA66","v":140.94999999999999},140.94999999999999,0,140.94999999999999,0.88,null,null,null,null,null,null,null,null,null,null,null,null,{"$f":"T66+U66","v":140.94999999999999},{"$f":"ROUND((T66+U66)-AF66*$H$326,2)","v":96.37},{"$f":"W66+X66","v":140.94999999999999},{"$f":"ROUND((W66+X66)-AF66*$G$326,2)","v":102.84},{"$f":"+Z66+AA66","v":140.94999999999999},{"$f":"ROUND((Z66+AA66)-AF66*$F$326,2)","v":106.06},140.94999999999999,108.49,null,"(ni podpore 2011/2)","(ni podpore 2011/2)","(ni podpore 2011/2)","(ni podpore 2011/2)",{"$f":"AU66-AS66","v":0},6.4699999999999989,0,3.2199999999999989,{"$f":"AY66-AW66","v":0},{"$f":"AZ66-AX66","v":2.4299999999999926}]
["SE22-2012dec","3.2 Sončne elektrarne - ostale 2012 december",null,"mala - manjše od 1MW","SE22",null,null,null,null,null,null,null,null,null,null,null,null,null,null,129.86000000000001,0,129.86000000000001,129.86000000000001,0,129.86000000000001,129.86000000000001,0,129.86000000000001,{"$f":"+Z67","v":129.86000000000001},{"$f":"+AA67","v":0},{"$f":"+AC67+AD67","v":129.86000000000001},0.88,null,null,null,null,null,null,null,null,null,null,null,null,{"$f":"T67+U67","v":129.86000000000001},85.28,{"$f":"W67+X67","v":129.86000000000001},91.75,{"$f":"+Z67+AA67","v":129.86000000000001},94.97,{"$f":"+AC67+AD67","v":129.86000000000001},{"$f":"ROUND((AC67+AD67)-AF67*$E$326,2)","v":97.4},null,"(ni podpore 2011/2)","(ni podpore 2011/2)","(ni podpore 2011/2)","(ni podpore 2011/2)",0,6.4699999999999989,{"$f":"AW67-AU67","v":0},{"$f":"AX67-AV67","v":3.2199999999999989},0,2.4300000000000068]
["SE23-2012dec","3.2 Sončne elektrarne - ostale 2012 december",null,"srednja - od 1MW do vključno 10MW ","SE23",null,null,null,null,null,null,null,null,null,null,null,null,null,null,104.68,0,104.68,104.68,0,104.68,104.68,0,104.68,104.68,0,104.68,0.91,null,null,null,null,null,null,null,null,null,null,null,null,{"$f":"T68+U68","v":104.68},58.58,{"$f":"W68+X68","v":104.68},65.27,{"$f":"+Z68+AA68","v":104.68},68.599999999999994,104.68,71.11,null,"(ni podpore 2011/2)","(ni podpore 2011/2)","(ni podpore 2011/2)","(ni podpore 2011/2)",0,6.6899999999999977,0,3.3299999999999983,0,2.5100000000000051]
["SE24-2012dec","3.2 Sončne elektrarne - ostale 2012 december",null,"velika - nad 10MW do vključno 125MW","SE24",null,null,null,null,null,null,null,null,null,null,null,null,null,null,97.19,0,97.19,97.19,0,97.19,97.19,0,97.19,97.19,0,97.19,1,null,null,null,null,null,null,null,null,null,null,null,null,"(ni ZO)",46.53,"(ni ZO)",53.88,"(ni ZO)",57.54,"(ni ZO)",60.3,null,"(ni podpore 2011/2)","(ni podpore 2011/2)","(ni podpore 2011/2)","(ni podpore 2011/2)","(ni ZO)",7.3500000000000014,"(ni ZO)",3.6599999999999966,"(ni ZO)",2.759999999999998]
["SE11-2013jan","3.1 Sončne elektrarne - na stavbah 2013 januar",null,"mikro - manjše od 50kW","SE11",null,null,null,null,null,null,null,null,null,null,null,null,null,null,{"$f":"ROUND(0.98*T62,2)","v":147},0,{"$f":"T70+U70","v":147},{"$f":"ROUND(0.98*W62,2)","v":147},0,147,147,0,147,147,0,147,0.88,null,null,null,null,null,null,null,null,null,null,null,null,{"$f":"T70+U70","v":147},102.42,{"$f":"W70+X70","v":147},108.89,{"$f":"+Z70+AA70","v":147},112.11,147,114.54,null,"(ni podpore 2011/2)","(ni podpore 2011/2)","(ni podpore 2011/2)","(ni podpore 2011/2)",{"$f":"AU70-AS70","v":0},6.4699999999999989,0,3.2199999999999989,0,2.4300000000000068]
["SE12-2013jan","3.1 Sončne elektrarne - na stavbah 2013 januar",null,"mala - manjše od 1MW","SE12",null,null,null,null,null,null,null,null,null,null,null,null,null,null,{"$f":"ROUND(0.98*T63,2)","v":134.44999999999999},0,134.44999999999999,{"$f":"ROUND(0.98*W63,2)","v":134.44999999999999},0,134.44999999999999,134.44999999999999,0,134.44999999999999,134.44999999999999,0,134.44999999999999,0.88,null,null,null,null,null,null,null,null,null,null,null,null,{"$f":"T71+U71","v":134.44999999999999},89.87,{"$f":"W71+X71","v":134.44999999999999},96.34,{"$f":"+Z71+AA71","v":134.44999999999999},99.56,134.44999999999999,101.99,null,"(ni podpore 2011/2)","(ni podpore 2011/2)","(ni podpore 2011/2)","(ni podpore 2011/2)",0,6.4699999999999989,0,3.2199999999999989,0,2.4299999999999926]
["SE13-2013jan","3.1 Sončne elektrarne - na stavbah 2013 januar",null,"srednja - od 1MW do vključno 10MW ","SE13",null,null,null,null,null,null,null,null,null,null,null,null,null,null,111.57,0,111.57,111.57,0,111.57,111.57,0,111.57,111.57,0,111.57,0.91,null,null,null,null,null,null,null,null,null,null,null,null,{"$f":"T72+U72","v":111.57},65.47,{"$f":"W72+X72","v":111.57},72.16,{"$f":"+Z72+AA72","v":111.57},75.489999999999995,111.57,78,null,"(ni podpore 2011/2)","(ni podpore 2011/2)","(ni podpore 2011/2)","(ni podpore 2011/2)",0,6.6899999999999977,0,3.3299999999999983,0,2.5100000000000051]
["SE14-2013jan","3.1 Sončne elektrarne - na stavbah 2013 januar",null,"velika - nad 10MW do vključno 125MW","SE14",null,null,null,null,null,null,null,null,null,null,null,null,null,null,99.31,0,99.31,99.31,0,99.31,99.31,0,99.31,99.31,0,99.31,1,null,null,null,null,null,null,null,null,null,null,null,null,"(ni ZO)",48.65,"(ni ZO)",56,"(ni ZO)",59.66,"(ni ZO)",62.42,null,"(ni podpore 2011/2)","(ni podpore 2011/2)","(ni podpore 2011/2)","(ni podpore 2011/2)","(ni ZO)",7.3500000000000014,"(ni ZO)",3.6599999999999966,"(ni ZO)",2.7600000000000051]
["SE21-2013jan","3.2 Sončne elektrarne - ostale 2013 januar",null,"mikro - manjše od 50kW","SE21",null,null,null,null,null,null,null,null,null,null,null,null,null,null,138.13,0,138.13,138.13,0,138.13,138.13,0,138.13,138.13,0,138.13,0.88,null,null,null,null,null,null,null,null,null,null,null,null,{"$f":"T74+U74","v":138.13},93.55,{"$f":"W74+X74","v":138.13},100.02,{"$f":"+Z74+AA74","v":138.13},103.24,138.13,105.67,null,"(ni podpore 2011/2)","(ni podpore 2011/2)","(ni podpore 2011/2)","(ni podpore 2011/2)",{"$f":"AU74-AS74","v":0},6.4699999999999989,0,3.2199999999999989,0,2.4300000000000068]
["SE22-2013jan","3.2 Sončne elektrarne - ostale 2013 januar",null,"mala - manjše od 1MW","SE22",null,null,null,null,null,null,null,null,null,null,null,null,null,null,127.26,0,127.26,127.26,0,127.26,127.26,0,127.26,127.26,0,127.26,0.88,null,null,null,null,null,null,null,null,null,null,null,null,{"$f":"T75+U75","v":127.26},82.68,{"$f":"W75+X75","v":127.26},89.15,{"$f":"+Z75+AA75","v":127.26},92.37,127.26,94.8,null,"(ni podpore 2011/2)","(ni podpore 2011/2)","(ni podpore 2011/2)","(ni podpore 2011/2)",0,6.4699999999999989,0,3.2199999999999989,0,2.4299999999999926]
["SE23-2013jan","3.2 Sončne elektrarne - ostale 2013 januar",null,"srednja - od 1MW do vključno 10MW ","SE23",null,null,null,null,null,null,null,null,null,null,null,null,null,null,102.59,0,102.59,102.59,0,102.59,102.59,0,102.59,102.59,0,102.59,0.91,null,null,null,null,null,null,null,null,null,null,null,null,{"$f":"T76+U76","v":102.59},56.49,{"$f":"W76+X76","v":102.59},63.18,{"$f":"+Z76+AA76","v":102.59},66.510000000000005,102.59,69.02,null,"(ni podpore 2011/2)","(ni podpore 2011/2)","(ni podpore 2011/2)","(ni podpore 2011/2)",0,6.6899999999999977,0,3.3300000000000054,0,2.5099999999999909]
["SE24-2013jan","3.2 Sončne elektrarne - ostale 2013 januar",null,"velika - nad 10MW do vključno 125MW","SE24",null,null,null,null,null,null,null,null,null,null,null,null,null,null,95.25,0,95.25,95.25,0,95.25,95.25,0,95.25,95.25,0,95.25,1,null,null,null,null,null,null,null,null,null,null,null,null,"(ni ZO)",44.59,"(ni ZO)",51.94,"(ni ZO)",55.6,"(ni ZO)",58.36,null,"(ni podpore 2011/2)","(ni podpore 2011/2)","(ni podpore 2011/2)","(ni podpore 2011/2)","(ni ZO)",7.3499999999999943,"(ni ZO)",3.6600000000000037,"(ni ZO)",2.759999999999998]
["SE11-2013feb","3.1 Sončne elektrarne - na stavbah 2013 februar",null,"mikro - manjše od 50kW","SE11",null,null,null,null,null,null,null,null,null,null,null,null,null,null,144.06,0,144.06,144.06,0,144.06,144.06,0,144.06,144.06,0,144.06,0.88,null,null,null,null,null,null,null,null,null,null,null,null,{"$f":"T78+U78","v":144.06},99.48,{"$f":"W78+X78","v":144.06},105.95,{"$f":"+Z78+AA78","v":144.06},109.17,144.06,111.6,null,"(ni podpore 2011/2)","(ni podpore 2011/2)","(ni podpore 2011/2)","(ni podpore 2011/2)",{"$f":"AU78-AS78","v":0},6.4699999999999989,0,3.2199999999999989,0,2.4299999999999926]
["SE12-2013feb","3.1 Sončne elektrarne - na stavbah 2013 februar",null,"mala - manjše od 1MW","SE12",null,null,null,null,null,null,null,null,null,null,null,null,null,null,131.76,0,131.76,131.76,0,131.76,131.76,0,131.76,131.76,0,131.76,0.88,null,null,null,null,null,null,null,null,null,null,null,null,{"$f":"T79+U79","v":131.76},87.18,{"$f":"W79+X79","v":131.76},93.65,{"$f":"+Z79+AA79","v":131.76},96.87,131.76,99.3,null,"(ni podpore 2011/2)","(ni podpore 2011/2)","(ni podpore 2011/2)","(ni podpore 2011/2)",0,6.4699999999999989,0,3.2199999999999989,0,2.4299999999999926]
["SE13-2013feb","3.1 Sončne elektrarne - na stavbah 2013 februar",null,"srednja - od 1MW do vključno 10MW ","SE13",null,null,null,null,null,null,null,null,null,null,null,null,null,null,109.34,0,109.34,109.34,0,109.34,109.34,0,109.34,109.34,0,109.34,0.91,null,null,null,null,null,null,null,null,null,null,null,null,{"$f":"T80+U80","v":109.34},63.24,{"$f":"W80+X80","v":109.34},69.930000000000007,{"$f":"+Z80+AA80","v":109.34},73.260000000000005,109.34,75.77,null,"(ni podpore 2011/2)","(ni podpore 2011/2)","(ni podpore 2011/2)","(ni podpore 2011/2)",0,6.6900000000000048,0,3.3299999999999983,0,2.5099999999999909]
["SE14-2013feb","3.1 Sončne elektrarne - na stavbah 2013 februar",null,"velika - nad 10MW do vključno 125MW","SE14",null,null,null,null,null,null,null,null,null,null,null,null,null,null,97.32,0,97.32,97.32,0,97.32,97.32,0,97.32,97.32,0,97.32,1,null,null,null,null,null,null,null,null,null,null,null,null,"(ni ZO)",46.66,"(ni ZO)",54.01,"(ni ZO)",57.67,"(ni ZO)",60.43,null,"(ni podpore 2011/2)","(ni podpore 2011/2)","(ni podpore 2011/2)","(ni podpore 2011/2)","(ni ZO)",7.3500000000000014,"(ni ZO)",3.6600000000000037,"(ni ZO)",2.759999999999998]
["SE21-2013feb","3.2 Sončne elektrarne - ostale 2013 februar",null,"mikro - manjše od 50kW","SE21",null,null,null,null,null,null,null,null,null,null,null,null,null,null,135.37,0,135.37,135.37,0,135.37,135.37,0,135.37,135.37,0,135.37,0.88,null,null,null,null,null,null,null,null,null,null,null,null,{"$f":"T82+U82","v":135.37},90.79,{"$f":"W82+X82","v":135.37},97.26,{"$f":"+Z82+AA82","v":135.37},100.48,135.37,102.91,null,"(ni podpore 2011/2)","(ni podpore 2011/2)","(ni podpore 2011/2)","(ni podpore 2011/2)",{"$f":"AU82-AS82","v":0},6.4699999999999989,0,3.2199999999999989,0,2.4299999999999926]
["SE22-2013feb","3.2 Sončne elektrarne - ostale 2013 februar",null,"mala - manjše od 1MW","SE22",null,null,null,null,null,null,null,null,null,null,null,null,null,null,124.71,0,124.71,124.71,0,124.71,124.71,0,124.71,124.71,0,124.71,0.88,null,null,null,null,null,null,null,null,null,null,null,null,{"$f":"T83+U83","v":124.71},80.13,{"$f":"W83+X83","v":124.71},86.6,{"$f":"+Z83+AA83","v":124.71},89.82,124.71,92.25,null,"(ni podpore 2011/2)","(ni podpore 2011/2)","(ni podpore 2011/2)","(ni podpore 2011/2)",0,6.4699999999999989,0,3.2199999999999989,0,2.4300000000000068]
["SE23-2013feb","3.2 Sončne elektrarne - ostale 2013 februar",null,"srednja - od 1MW do vključno 10MW ","SE23",null,null,null,null,null,null,null,null,null,null,null,null,null,null,100.54,0,100.54,100.54,0,100.54,100.54,0,100.54,100.54,0,100.54,0.91,null,null,null,null,null,null,null,null,null,null,null,null,{"$f":"T84+U84","v":100.54},54.44,{"$f":"W84+X84","v":100.54},61.13,{"$f":"+Z84+AA84","v":100.54},64.459999999999994,100.54,66.97,null,"(ni podpore 2011/2)","(ni podpore 2011/2)","(ni podpore 2011/2)","(ni podpore 2011/2)",0,6.6900000000000048,0,3.3299999999999912,0,2.5100000000000051]
["SE24-2013feb","3.2 Sončne elektrarne - ostale 2013 februar",null,"velika - nad 10MW do vključno 125MW","SE24",null,null,null,null,null,null,null,null,null,null,null,null,null,null,93.35,0,93.35,93.35,0,93.35,93.35,0,93.35,93.35,0,93.35,1,null,null,null,null,null,null,null,null,null,null,null,null,"(ni ZO)",42.69,"(ni ZO)",50.04,"(ni ZO)",53.7,"(ni ZO)",56.46,null,"(ni podpore 2011/2)","(ni podpore 2011/2)","(ni podpore 2011/2)","(ni podpore 2011/2)","(ni ZO)",7.3500000000000014,"(ni ZO)",3.6600000000000037,"(ni ZO)",2.759999999999998]
["SE11-2013mar","3.1 Sončne elektrarne - na stavbah 2013 marec",null,"mikro - manjše od 50kW","SE11",null,null,null,null,null,null,null,null,null,null,null,null,null,null,141.18,0,141.18,141.18,0,141.18,141.18,0,141.18,141.18,0,141.18,0.88,null,null,null,null,null,null,null,null,null,null,null,null,{"$f":"T86+U86","v":141.18},96.6,{"$f":"W86+X86","v":141.18},103.07,{"$f":"+Z86+AA86","v":141.18},106.29,141.18,108.72,null,"(ni podpore 2011/2)","(ni podpore 2011/2)","(ni podpore 2011/2)","(ni podpore 2011/2)",{"$f":"AU86-AS86","v":0},6.4699999999999989,0,3.2200000000000131,0,2.4299999999999926]
["SE12-2013mar","3.1 Sončne elektrarne - na stavbah 2013 marec",null,"mala - manjše od 1MW","SE12",null,null,null,null,null,null,null,null,null,null,null,null,null,null,129.12,0,129.12,129.12,0,129.12,129.12,0,129.12,129.12,0,129.12,0.88,null,null,null,null,null,null,null,null,null,null,null,null,{"$f":"T87+U87","v":129.12},84.54,{"$f":"W87+X87","v":129.12},91.01,{"$f":"+Z87+AA87","v":129.12},94.23,129.12,96.66,null,"(ni podpore 2011/2)","(ni podpore 2011/2)","(ni podpore 2011/2)","(ni podpore 2011/2)",0,6.4699999999999989,0,3.2199999999999989,0,2.4299999999999926]
["SE13-2013mar","3.1 Sončne elektrarne - na stavbah 2013 marec",null,"srednja - od 1MW do vključno 10MW ","SE13",null,null,null,null,null,null,null,null,null,null,null,null,null,null,107.15,0,107.15,107.15,0,107.15,107.15,0,107.15,107.15,0,107.15,0.91,null,null,null,null,null,null,null,null,null,null,null,null,{"$f":"T88+U88","v":107.15},61.05,{"$f":"W88+X88","v":107.15},67.739999999999995,{"$f":"+Z88+AA88","v":107.15},71.069999999999993,107.15,73.58,null,"(ni podpore 2011/2)","(ni podpore 2011/2)","(ni podpore 2011/2)","(ni podpore 2011/2)",0,6.6899999999999977,0,3.3299999999999983,0,2.5100000000000051]
["SE14-2013mar","3.1 Sončne elektrarne - na stavbah 2013 marec",null,"velika - nad 10MW do vključno 125MW","SE14",null,null,null,null,null,null,null,null,null,null,null,null,null,null,95.37,0,95.37,95.37,0,95.37,95.37,0,95.37,95.37,0,95.37,1,null,null,null,null,null,null,null,null,null,null,null,null,"(ni ZO)",44.71,"(ni ZO)",52.06,"(ni ZO)",55.72,"(ni ZO)",58.48,null,"(ni podpore 2011/2)","(ni podpore 2011/2)","(ni podpore 2011/2)","(ni podpore 2011/2)","(ni ZO)",7.3500000000000014,"(ni ZO)",3.6599999999999966,"(ni ZO)",2.759999999999998]
["SE21-2013mar","3.2 Sončne elektrarne - ostale 2013 marec",null,"mikro - manjše od 50kW","SE21",null,null,null,null,null,null,null,null,null,null,null,null,null,null,132.66,0,132.66,132.66,0,132.66,132.66,0,132.66,132.66,0,132.66,0.88,null,null,null,null,null,null,null,null,null,null,null,null,{"$f":"T90+U90","v":132.66},88.08,{"$f":"W90+X90","v":132.66},94.55,{"$f":"+Z90+AA90","v":132.66},97.77,132.66,100.2,null,"(ni podpore 2011/2)","(ni podpore 2011/2)","(ni podpore 2011/2)","(ni podpore 2011/2)",{"$f":"AU90-AS90","v":0},6.4699999999999989,0,3.2199999999999989,0,2.4300000000000068]
["SE22-2013mar","3.2 Sončne elektrarne - ostale 2013 marec",null,"mala - manjše od 1MW","SE22",null,null,null,null,null,null,null,null,null,null,null,null,null,null,122.22,0,122.22,122.22,0,122.22,122.22,0,122.22,122.22,0,122.22,0.88,null,null,null,null,null,null,null,null,null,null,null,null,{"$f":"T91+U91","v":122.22},77.64,{"$f":"W91+X91","v":122.22},84.11,{"$f":"+Z91+AA91","v":122.22},87.33,122.22,89.76,null,"(ni podpore 2011/2)","(ni podpore 2011/2)","(ni podpore 2011/2)","(ni podpore 2011/2)",0,6.4699999999999989,0,3.2199999999999989,0,2.4300000000000068]
["SE23-2013mar","3.2 Sončne elektrarne - ostale 2013 marec",null,"srednja - od 1MW do vključno 10MW ","SE23",null,null,null,null,null,null,null,null,null,null,null,null,null,null,98.53,0,98.53,98.53,0,98.53,98.53,0,98.53,98.53,0,98.53,0.91,null,null,null,null,null,null,null,null,null,null,null,null,{"$f":"T92+U92","v":98.53},52.43,{"$f":"W92+X92","v":98.53},59.12,{"$f":"+Z92+AA92","v":98.53},62.45,98.53,64.959999999999994,null,"(ni podpore 2011/2)","(ni podpore 2011/2)","(ni podpore 2011/2)","(ni podpore 2011/2)",0,6.6899999999999977,0,3.3300000000000054,0,2.5099999999999909]
["SE24-2013mar","3.2 Sončne elektrarne - ostale 2013 marec",null,"velika - nad 10MW do vključno 125MW","SE24",null,null,null,null,null,null,null,null,null,null,null,null,null,null,91.48,0,91.48,91.48,0,91.48,91.48,0,91.48,91.48,0,91.48,1,null,null,null,null,null,null,null,null,null,null,null,null,"(ni ZO)",40.82,"(ni ZO)",48.17,"(ni ZO)",51.83,"(ni ZO)",54.59,null,"(ni podpore 2011/2)","(ni podpore 2011/2)","(ni podpore 2011/2)","(ni podpore 2011/2)","(ni ZO)",7.3500000000000014,"(ni ZO)",3.6599999999999966,"(ni ZO)",2.7600000000000051]
["SE11-2013apr","3.1 Sončne elektrarne - na stavbah 2013 april",null,"mikro - manjše od 50kW","SE11",null,null,null,null,null,null,null,null,null,null,null,null,null,null,138.36000000000001,0,138.36000000000001,138.36000000000001,0,138.36000000000001,138.36000000000001,0,138.36000000000001,138.36000000000001,0,138.36000000000001,0.88,null,null,null,null,null,null,null,null,null,null,null,null,{"$f":"T94+U94","v":138.36000000000001},93.78,{"$f":"W94+X94","v":138.36000000000001},100.25,{"$f":"+Z94+AA94","v":138.36000000000001},103.47,138.36000000000001,105.9,null,"(ni podpore 2011/2)","(ni podpore 2011/2)","(ni podpore 2011/2)","(ni podpore 2011/2)",{"$f":"AU94-AS94","v":0},6.4699999999999989,0,3.2199999999999989,0,2.4300000000000068]
["SE12-2013apr","3.1 Sončne elektrarne - na stavbah 2013 april",null,"mala - manjše od 1MW","SE12",null,null,null,null,null,null,null,null,null,null,null,null,null,null,126.54,0,126.54,126.54,0,126.54,126.54,0,126.54,126.54,0,126.54,0.88,null,null,null,null,null,null,null,null,null,null,null,null,{"$f":"T95+U95","v":126.54},81.96,{"$f":"W95+X95","v":126.54},88.43,{"$f":"+Z95+AA95","v":126.54},91.65,126.54,94.08,null,"(ni podpore 2011/2)","(ni podpore 2011/2)","(ni podpore 2011/2)","(ni podpore 2011/2)",0,6.4700000000000131,0,3.2199999999999989,0,2.4299999999999926]
["SE13-2013apr","3.1 Sončne elektrarne - na stavbah 2013 april",null,"srednja - od 1MW do vključno 10MW ","SE13",null,null,null,null,null,null,null,null,null,null,null,null,null,null,105.01,0,105.01,105.01,0,105.01,105.01,0,105.01,105.01,0,105.01,0.91,null,null,null,null,null,null,null,null,null,null,null,null,{"$f":"T96+U96","v":105.01},58.91,{"$f":"W96+X96","v":105.01},65.599999999999994,{"$f":"+Z96+AA96","v":105.01},68.930000000000007,105.01,71.44,null,"(ni podpore 2011/2)","(ni podpore 2011/2)","(ni podpore 2011/2)","(ni podpore 2011/2)",0,6.6899999999999977,0,3.3300000000000125,0,2.5099999999999909]
["SE14-2013apr","3.1 Sončne elektrarne - na stavbah 2013 april",null,"velika - nad 10MW do vključno 125MW","SE14",null,null,null,null,null,null,null,null,null,null,null,null,null,null,93.46,0,93.46,93.46,0,93.46,93.46,0,93.46,93.46,0,93.46,1,null,null,null,null,null,null,null,null,null,null,null,null,"(ni ZO)",42.8,"(ni ZO)",50.15,"(ni ZO)",53.81,"(ni ZO)",56.57,null,"(ni podpore 2011/2)","(ni podpore 2011/2)","(ni podpore 2011/2)","(ni podpore 2011/2)","(ni ZO)",7.3500000000000014,"(ni ZO)",3.6600000000000037,"(ni ZO)",2.759999999999998]
["SE21-2013apr","3.2 Sončne elektrarne - ostale 2013 april",null,"mikro - manjše od 50kW","SE21",null,null,null,null,null,null,null,null,null,null,null,null,null,null,130.01,0,130.01,130.01,0,130.01,130.01,0,130.01,130.01,0,130.01,0.88,null,null,null,null,null,null,null,null,null,null,null,null,{"$f":"T98+U98","v":130.01},{"$f":"ROUND((T98+U98)-AF98*$H$326,2)","v":85.43},{"$f":"W98+X98","v":130.01},91.9,{"$f":"+Z98+AA98","v":130.01},95.12,130.01,97.55,null,"(ni podpore 2011/2)","(ni podpore 2011/2)","(ni podpore 2011/2)","(ni podpore 2011/2)",{"$f":"AU98-AS98","v":0},6.4699999999999989,0,3.2199999999999989,0,2.4299999999999926]
["SE22-2013apr","3.2 Sončne elektrarne - ostale 2013 april",null,"mala - manjše od 1MW","SE22",null,null,null,null,null,null,null,null,null,null,null,null,null,null,119.78,0,119.78,119.78,0,119.78,119.78,0,119.78,119.78,0,119.78,0.88,null,null,null,null,null,null,null,null,null,null,null,null,{"$f":"T99+U99","v":119.78},75.2,{"$f":"W99+X99","v":119.78},81.67,{"$f":"+Z99+AA99","v":119.78},84.89,119.78,87.32,null,"(ni podpore 2011/2)","(ni podpore 2011/2)","(ni podpore 2011/2)","(ni podpore 2011/2)",0,6.4699999999999989,0,3.2199999999999989,0,2.4299999999999926]
["SE23-2013apr","3.2 Sončne elektrarne - ostale 2013 april",null,"srednja - od 1MW do vključno 10MW ","SE23",null,null,null,null,null,null,null,null,null,null,null,null,null,null,96.56,0,96.56,96.56,0,96.56,96.56,0,96.56,96.56,0,96.56,0.91,null,null,null,null,null,null,null,null,null,null,null,null,{"$f":"T100+U100","v":96.56},50.46,{"$f":"W100+X100","v":96.56},57.15,{"$f":"+Z100+AA100","v":96.56},60.48,96.56,62.99,null,"(ni podpore 2011/2)","(ni podpore 2011/2)","(ni podpore 2011/2)","(ni podpore 2011/2)",0,6.6899999999999977,0,3.3299999999999983,0,2.5100000000000051]
["SE24-2013apr","3.2 Sončne elektrarne - ostale 2013 april",null,"velika - nad 10MW do vključno 125MW","SE24",null,null,null,null,null,null,null,null,null,null,null,null,null,null,89.65,0,89.65,89.65,0,89.65,89.65,0,89.65,89.65,0,89.65,1,null,null,null,null,null,null,null,null,null,null,null,null,"(ni ZO)",38.99,"(ni ZO)",46.34,"(ni ZO)",50,"(ni ZO)",52.76,null,"(ni podpore 2011/2)","(ni podpore 2011/2)","(ni podpore 2011/2)","(ni podpore 2011/2)","(ni ZO)",7.3500000000000014,"(ni ZO)",3.6599999999999966,"(ni ZO)",2.759999999999998]
["SE11-2013maj","3.1 Sončne elektrarne - na stavbah 2013 maj",null,"mikro - manjše od 50kW","SE11",null,null,null,null,null,null,null,null,null,null,null,null,null,null,135.59,0,135.59,135.59,0,135.59,135.59,0,135.59,135.59,0,135.59,0.88,null,null,null,null,null,null,null,null,null,null,null,null,{"$f":"T102+U102","v":135.59},91.01,{"$f":"W102+X102","v":135.59},97.48,{"$f":"+Z102+AA102","v":135.59},100.7,135.59,103.13,null,"(ni podpore 2011/2)","(ni podpore 2011/2)","(ni podpore 2011/2)","(ni podpore 2011/2)",{"$f":"AU102-AS102","v":0},6.4699999999999989,0,3.2199999999999989,0,2.4299999999999926]
["SE12-2013maj","3.1 Sončne elektrarne - na stavbah 2013 maj",null,"mala - manjše od 1MW","SE12",null,null,null,null,null,null,null,null,null,null,null,null,null,null,124.01,0,124.01,124.01,0,124.01,124.01,0,124.01,124.01,0,124.01,0.88,null,null,null,null,null,null,null,null,null,null,null,null,{"$f":"T103+U103","v":124.01},79.430000000000007,{"$f":"W103+X103","v":124.01},85.9,{"$f":"+Z103+AA103","v":124.01},89.12,124.01,91.55,null,"(ni podpore 2011/2)","(ni podpore 2011/2)","(ni podpore 2011/2)","(ni podpore 2011/2)",0,6.4699999999999989,0,3.2199999999999989,0,2.4299999999999926]
["SE13-2013maj","3.1 Sončne elektrarne - na stavbah 2013 maj",null,"srednja - od 1MW do vključno 10MW ","SE13",null,null,null,null,null,null,null,null,null,null,null,null,null,null,102.91,0,102.91,102.91,0,102.91,102.91,0,102.91,102.91,0,102.91,0.91,null,null,null,null,null,null,null,null,null,null,null,null,{"$f":"T104+U104","v":102.91},56.81,{"$f":"W104+X104","v":102.91},63.5,{"$f":"+Z104+AA104","v":102.91},66.83,102.91,69.34,null,"(ni podpore 2011/2)","(ni podpore 2011/2)","(ni podpore 2011/2)","(ni podpore 2011/2)",0,6.6899999999999977,0,3.3299999999999983,0,2.5100000000000051]
["SE14-2013maj","3.1 Sončne elektrarne - na stavbah 2013 maj",null,"velika - nad 10MW do vključno 125MW","SE14",null,null,null,null,null,null,null,null,null,null,null,null,null,null,91.59,0,91.59,91.59,0,91.59,91.59,0,91.59,91.59,0,91.59,1,null,null,null,null,null,null,null,null,null,null,null,null,"(ni ZO)",40.93,"(ni ZO)",48.28,"(ni ZO)",51.94,"(ni ZO)",54.7,null,"(ni podpore 2011/2)","(ni podpore 2011/2)","(ni podpore 2011/2)","(ni podpore 2011/2)","(ni ZO)",7.3500000000000014,"(ni ZO)",3.6599999999999966,"(ni ZO)",2.7600000000000051]
["SE21-2013maj","3.2 Sončne elektrarne - ostale 2013 maj",null,"mikro - manjše od 50kW","SE21",null,null,null,null,null,null,null,null,null,null,null,null,null,null,127.41,0,127.41,127.41,0,127.41,127.41,0,127.41,127.41,0,127.41,0.88,null,null,null,null,null,null,null,null,null,null,null,null,{"$f":"T106+U106","v":127.41},82.83,{"$f":"W106+X106","v":127.41},89.3,{"$f":"+Z106+AA106","v":127.41},92.52,127.41,94.95,null,"(ni podpore 2011/2)","(ni podpore 2011/2)","(ni podpore 2011/2)","(ni podpore 2011/2)",{"$f":"AU106-AS106","v":0},6.4699999999999989,0,3.2199999999999989,0,2.4300000000000068]
["SE22-2013maj","3.2 Sončne elektrarne - ostale 2013 maj",null,"mala - manjše od 1MW","SE22",null,null,null,null,null,null,null,null,null,null,null,null,null,null,117.38,0,117.38,117.38,0,117.38,117.38,0,117.38,117.38,0,117.38,0.88,null,null,null,null,null,null,null,null,null,null,null,null,{"$f":"T107+U107","v":117.38},72.8,{"$f":"W107+X107","v":117.38},79.27,{"$f":"+Z107+AA107","v":117.38},82.49,117.38,84.92,null,"(ni podpore 2011/2)","(ni podpore 2011/2)","(ni podpore 2011/2)","(ni podpore 2011/2)",0,6.4699999999999989,0,3.2199999999999989,0,2.4300000000000068]
["SE23-2013maj","3.2 Sončne elektrarne - ostale 2013 maj",null,"srednja - od 1MW do vključno 10MW ","SE23",null,null,null,null,null,null,null,null,null,null,null,null,null,null,94.63,0,94.63,94.63,0,94.63,94.63,0,94.63,94.63,0,94.63,0.91,null,null,null,null,null,null,null,null,null,null,null,null,{"$f":"T108+U108","v":94.63},48.53,{"$f":"W108+X108","v":94.63},55.22,{"$f":"+Z108+AA108","v":94.63},58.55,94.63,61.06,null,"(ni podpore 2011/2)","(ni podpore 2011/2)","(ni podpore 2011/2)","(ni podpore 2011/2)",0,6.6899999999999977,0,3.3299999999999983,0,2.5100000000000051]
["SE24-2013maj","3.2 Sončne elektrarne - ostale 2013 maj",null,"velika - nad 10MW do vključno 125MW","SE24",null,null,null,null,null,null,null,null,null,null,null,null,null,null,87.86,0,87.86,87.86,0,87.86,87.86,0,87.86,87.86,0,87.86,1,null,null,null,null,null,null,null,null,null,null,null,null,"(ni ZO)",37.200000000000003,"(ni ZO)",44.55,"(ni ZO)",48.21,"(ni ZO)",50.97,null,"(ni podpore 2011/2)","(ni podpore 2011/2)","(ni podpore 2011/2)","(ni podpore 2011/2)","(ni ZO)",7.3499999999999943,"(ni ZO)",3.6600000000000037,"(ni ZO)",2.759999999999998]
["SE11-2013jun","3.1 Sončne elektrarne - na stavbah 2013 junij",null,"mikro - manjše od 50kW","SE11",null,null,null,null,null,null,null,null,null,null,null,null,null,null,132.88,0,132.88,132.88,0,132.88,132.88,0,132.88,132.88,0,132.88,0.88,null,null,null,null,null,null,null,null,null,null,null,null,{"$f":"T110+U110","v":132.88},88.3,{"$f":"W110+X110","v":132.88},94.77,{"$f":"+Z110+AA110","v":132.88},97.99,132.88,100.42,null,"(ni podpore 2011/2)","(ni podpore 2011/2)","(ni podpore 2011/2)","(ni podpore 2011/2)",{"$f":"AU110-AS110","v":0},6.4699999999999989,0,3.2199999999999989,0,2.4300000000000068]
["SE12-2013jun","3.1 Sončne elektrarne - na stavbah 2013 junij",null,"mala - manjše od 1MW","SE12",null,null,null,null,null,null,null,null,null,null,null,null,null,null,121.53,0,121.53,121.53,0,121.53,121.53,0,121.53,121.53,0,121.53,0.88,null,null,null,null,null,null,null,null,null,null,null,null,{"$f":"T111+U111","v":121.53},76.95,{"$f":"W111+X111","v":121.53},83.42,{"$f":"+Z111+AA111","v":121.53},86.64,121.53,89.07,null,"(ni podpore 2011/2)","(ni podpore 2011/2)","(ni podpore 2011/2)","(ni podpore 2011/2)",0,6.4699999999999989,0,3.2199999999999989,0,2.4299999999999926]
["SE13-2013jun","3.1 Sončne elektrarne - na stavbah 2013 junij",null,"srednja - od 1MW do vključno 10MW ","SE13",null,null,null,null,null,null,null,null,null,null,null,null,null,null,100.85,0,100.85,100.85,0,100.85,100.85,0,100.85,100.85,0,100.85,0.91,null,null,null,null,null,null,null,null,null,null,null,null,{"$f":"T112+U112","v":100.85},54.75,{"$f":"W112+X112","v":100.85},61.44,{"$f":"+Z112+AA112","v":100.85},64.77,100.85,67.28,null,"(ni podpore 2011/2)","(ni podpore 2011/2)","(ni podpore 2011/2)","(ni podpore 2011/2)",0,6.6899999999999977,0,3.3299999999999983,0,2.5100000000000051]
["SE14-2013jun","3.1 Sončne elektrarne - na stavbah 2013 junij",null,"velika - nad 10MW do vključno 125MW","SE14",null,null,null,null,null,null,null,null,null,null,null,null,null,null,89.76,0,89.76,89.76,0,89.76,89.76,0,89.76,89.76,0,89.76,1,null,null,null,null,null,null,null,null,null,null,null,null,"(ni ZO)",39.1,"(ni ZO)",46.45,"(ni ZO)",50.11,"(ni ZO)",52.87,null,"(ni podpore 2011/2)","(ni podpore 2011/2)","(ni podpore 2011/2)","(ni podpore 2011/2)","(ni ZO)",7.3500000000000014,"(ni ZO)",3.6599999999999966,"(ni ZO)",2.759999999999998]
["SE21-2013jun","3.2 Sončne elektrarne - ostale 2013 junij",null,"mikro - manjše od 50kW","SE21",null,null,null,null,null,null,null,null,null,null,null,null,null,null,124.86,0,124.86,124.86,0,124.86,124.86,0,124.86,124.86,0,124.86,0.88,null,null,null,null,null,null,null,null,null,null,null,null,{"$f":"T114+U114","v":124.86},80.28,{"$f":"W114+X114","v":124.86},86.75,{"$f":"+Z114+AA114","v":124.86},89.97,124.86,92.4,null,"(ni podpore 2011/2)","(ni podpore 2011/2)","(ni podpore 2011/2)","(ni podpore 2011/2)",{"$f":"AU114-AS114","v":0},6.4699999999999989,0,3.2199999999999989,0,2.4300000000000068]
["SE22-2013jun","3.2 Sončne elektrarne - ostale 2013 junij",null,"mala - manjše od 1MW","SE22",null,null,null,null,null,null,null,null,null,null,null,null,null,null,115.03,0,115.03,115.03,0,115.03,115.03,0,115.03,115.03,0,115.03,0.88,null,null,null,null,null,null,null,null,null,null,null,null,{"$f":"T115+U115","v":115.03},70.45,{"$f":"W115+X115","v":115.03},76.92,{"$f":"+Z115+AA115","v":115.03},80.14,115.03,82.57,null,"(ni podpore 2011/2)","(ni podpore 2011/2)","(ni podpore 2011/2)","(ni podpore 2011/2)",0,6.4699999999999989,0,3.2199999999999989,0,2.4299999999999926]
["SE23-2013jun","3.2 Sončne elektrarne - ostale 2013 junij",null,"srednja - od 1MW do vključno 10MW ","SE23",null,null,null,null,null,null,null,null,null,null,null,null,null,null,92.74,0,92.74,92.74,0,92.74,92.74,0,92.74,92.74,0,92.74,0.91,null,null,null,null,null,null,null,null,null,null,null,null,{"$f":"T116+U116","v":92.74},46.64,{"$f":"W116+X116","v":92.74},53.33,{"$f":"+Z116+AA116","v":92.74},56.66,92.74,59.17,null,"(ni podpore 2011/2)","(ni podpore 2011/2)","(ni podpore 2011/2)","(ni podpore 2011/2)",0,6.6899999999999977,0,3.3299999999999983,0,2.5100000000000051]
["SE24-2013jun","3.2 Sončne elektrarne - ostale 2013 junij",null,"velika - nad 10MW do vključno 125MW","SE24",null,null,null,null,null,null,null,null,null,null,null,null,null,null,86.1,0,86.1,86.1,0,86.1,86.1,0,86.1,86.1,0,86.1,1,null,null,null,null,null,null,null,null,null,null,null,null,"(ni ZO)",35.44,"(ni ZO)",42.79,"(ni ZO)",46.45,"(ni ZO)",49.21,null,"(ni podpore 2011/2)","(ni podpore 2011/2)","(ni podpore 2011/2)","(ni podpore 2011/2)","(ni ZO)",7.3500000000000014,"(ni ZO)",3.6600000000000037,"(ni ZO)",2.759999999999998]
["SE11-2013jul","3.1 Sončne elektrarne - na stavbah 2013 julij",null,"mikro - manjše od 50kW","SE11",null,null,null,null,null,null,null,null,null,null,null,null,null,null,130.22,0,130.22,130.22,0,130.22,130.22,0,130.22,130.22,0,130.22,0.88,null,null,null,null,null,null,null,null,null,null,null,null,{"$f":"T118+U118","v":130.22},85.64,{"$f":"W118+X118","v":130.22},92.11,{"$f":"+Z118+AA118","v":130.22},95.33,130.22,97.76,null,"(ni podpore 2011/2)","(ni podpore 2011/2)","(ni podpore 2011/2)","(ni podpore 2011/2)",{"$f":"AU118-AS118","v":0},6.4699999999999989,0,3.2199999999999989,0,2.4300000000000068]
["SE12-2013jul","3.1 Sončne elektrarne - na stavbah 2013 julij",null,"mala - manjše od 1MW","SE12",null,null,null,null,null,null,null,null,null,null,null,null,null,null,119.1,0,119.1,119.1,0,119.1,119.1,0,119.1,119.1,0,119.1,0.88,null,null,null,null,null,null,null,null,null,null,null,null,{"$f":"T119+U119","v":119.1},74.52,{"$f":"W119+X119","v":119.1},80.989999999999995,{"$f":"+Z119+AA119","v":119.1},84.21,119.1,86.64,null,"(ni podpore 2011/2)","(ni podpore 2011/2)","(ni podpore 2011/2)","(ni podpore 2011/2)",0,6.4699999999999989,0,3.2199999999999989,0,2.4300000000000068]
["SE13-2013jul","3.1 Sončne elektrarne - na stavbah 2013 julij",null,"srednja - od 1MW do vključno 10MW ","SE13",null,null,null,null,null,null,null,null,null,null,null,null,null,null,98.83,0,98.83,98.83,0,98.83,98.83,0,98.83,98.83,0,98.83,0.91,null,null,null,null,null,null,null,null,null,null,null,null,{"$f":"T120+U120","v":98.83},52.73,{"$f":"W120+X120","v":98.83},59.42,{"$f":"+Z120+AA120","v":98.83},62.75,98.83,65.260000000000005,null,"(ni podpore 2011/2)","(ni podpore 2011/2)","(ni podpore 2011/2)","(ni podpore 2011/2)",0,6.6900000000000048,0,3.3299999999999983,0,2.5100000000000051]
["SE14-2013jul","3.1 Sončne elektrarne - na stavbah 2013 julij",null,"velika - nad 10MW do vključno 125MW","SE14",null,null,null,null,null,null,null,null,null,null,null,null,null,null,87.96,0,87.96,87.96,0,87.96,87.96,0,87.96,87.96,0,87.96,1,null,null,null,null,null,null,null,null,null,null,null,null,"(ni ZO)",37.299999999999997,"(ni ZO)",44.65,"(ni ZO)",48.31,"(ni ZO)",51.07,null,"(ni podpore 2011/2)","(ni podpore 2011/2)","(ni podpore 2011/2)","(ni podpore 2011/2)","(ni ZO)",7.3500000000000014,"(ni ZO)",3.6600000000000037,"(ni ZO)",2.759999999999998]
["SE21-2013jul","3.2 Sončne elektrarne - ostale 2013 julij",null,"mikro - manjše od 50kW","SE21",null,null,null,null,null,null,null,null,null,null,null,null,null,null,122.36,0,122.36,122.36,0,122.36,122.36,0,122.36,122.36,0,122.36,0.88,null,null,null,null,null,null,null,null,null,null,null,null,{"$f":"T122+U122","v":122.36},77.78,{"$f":"W122+X122","v":122.36},84.25,{"$f":"+Z122+AA122","v":122.36},87.47,122.36,89.9,null,"(ni podpore 2011/2)","(ni podpore 2011/2)","(ni podpore 2011/2)","(ni podpore 2011/2)",{"$f":"AU122-AS122","v":0},6.4699999999999989,0,3.2199999999999989,0,2.4300000000000068]
["SE22-2013jul","3.2 Sončne elektrarne - ostale 2013 julij",null,"mala - manjše od 1MW","SE22",null,null,null,null,null,null,null,null,null,null,null,null,null,null,112.73,0,112.73,112.73,0,112.73,112.73,0,112.73,112.73,0,112.73,0.88,null,null,null,null,null,null,null,null,null,null,null,null,{"$f":"T123+U123","v":112.73},68.150000000000006,{"$f":"W123+X123","v":112.73},74.62,{"$f":"+Z123+AA123","v":112.73},77.84,112.73,80.27,null,"(ni podpore 2011/2)","(ni podpore 2011/2)","(ni podpore 2011/2)","(ni podpore 2011/2)",0,6.4699999999999989,0,3.2199999999999989,0,2.4299999999999926]
["SE23-2013jul","3.2 Sončne elektrarne - ostale 2013 julij",null,"srednja - od 1MW do vključno 10MW ","SE23",null,null,null,null,null,null,null,null,null,null,null,null,null,null,90.89,0,90.89,90.89,0,90.89,90.89,0,90.89,90.89,0,90.89,0.91,null,null,null,null,null,null,null,null,null,null,null,null,{"$f":"T124+U124","v":90.89},44.79,{"$f":"W124+X124","v":90.89},51.48,{"$f":"+Z124+AA124","v":90.89},54.81,90.89,57.32,null,"(ni podpore 2011/2)","(ni podpore 2011/2)","(ni podpore 2011/2)","(ni podpore 2011/2)",0,6.6899999999999977,0,3.3300000000000054,0,2.509999999999998]
["SE24-2013jul","3.2 Sončne elektrarne - ostale 2013 julij",null,"velika - nad 10MW do vključno 125MW","SE24",null,null,null,null,null,null,null,null,null,null,null,null,null,null,84.38,0,84.38,84.38,0,84.38,84.38,0,84.38,84.38,0,84.38,1,null,null,null,null,null,null,null,null,null,null,null,null,"(ni ZO)",33.72,"(ni ZO)",41.07,"(ni ZO)",44.73,"(ni ZO)",47.49,null,"(ni podpore 2011/2)","(ni podpore 2011/2)","(ni podpore 2011/2)","(ni podpore 2011/2)","(ni ZO)",7.3500000000000014,"(ni ZO)",3.6599999999999966,"(ni ZO)",2.7600000000000051]
["SE11-2013avg","3.1 Sončne elektrarne - na stavbah 2013 avgust",null,"mikro - manjše od 50kW","SE11",null,null,null,null,null,null,null,null,null,null,null,null,null,null,127.62,0,127.62,127.62,0,127.62,127.62,0,127.62,127.62,0,127.62,0.88,null,null,null,null,null,null,null,null,null,null,null,null,{"$f":"T126+U126","v":127.62},83.04,{"$f":"W126+X126","v":127.62},89.51,{"$f":"+Z126+AA126","v":127.62},92.73,127.62,95.16,null,"(ni podpore 2011/2)","(ni podpore 2011/2)","(ni podpore 2011/2)","(ni podpore 2011/2)",{"$f":"AU126-AS126","v":0},{"$f":"AV126-AT126","v":6.4699999999999989},0,3.2199999999999989,0,2.4299999999999926]
["SE12-2013avg","3.1 Sončne elektrarne - na stavbah 2013 avgust",null,"mala - manjše od 1MW","SE12",null,null,null,null,null,null,null,null,null,null,null,null,null,null,116.72,0,116.72,116.72,0,116.72,116.72,0,116.72,116.72,0,116.72,0.88,null,null,null,null,null,null,null,null,null,null,null,null,{"$f":"T127+U127","v":116.72},72.14,{"$f":"W127+X127","v":116.72},78.61,{"$f":"+Z127+AA127","v":116.72},81.83,116.72,84.26,null,"(ni podpore 2011/2)","(ni podpore 2011/2)","(ni podpore 2011/2)","(ni podpore 2011/2)",0,6.4699999999999989,0,3.2199999999999989,0,2.4300000000000068]
["SE13-2013avg","3.1 Sončne elektrarne - na stavbah 2013 avgust",null,"srednja - od 1MW do vključno 10MW ","SE13",null,null,null,null,null,null,null,null,null,null,null,null,null,null,96.85,0,96.85,96.85,0,96.85,96.85,0,96.85,96.85,0,96.85,0.91,null,null,null,null,null,null,null,null,null,null,null,null,{"$f":"T128+U128","v":96.85},50.75,{"$f":"W128+X128","v":96.85},57.44,{"$f":"+Z128+AA128","v":96.85},60.77,96.85,63.28,null,"(ni podpore 2011/2)","(ni podpore 2011/2)","(ni podpore 2011/2)","(ni podpore 2011/2)",0,6.6899999999999977,0,3.3300000000000054,0,2.509999999999998]
["SE14-2013avg","3.1 Sončne elektrarne - na stavbah 2013 avgust",null,"velika - nad 10MW do vključno 125MW","SE14",null,null,null,null,null,null,null,null,null,null,null,null,null,null,86.2,0,86.2,86.2,0,86.2,86.2,0,86.2,86.2,0,86.2,1,null,null,null,null,null,null,null,null,null,null,null,null,"(ni ZO)",35.54,"(ni ZO)",42.89,"(ni ZO)",46.55,"(ni ZO)",49.31,null,"(ni podpore 2011/2)","(ni podpore 2011/2)","(ni podpore 2011/2)","(ni podpore 2011/2)","(ni ZO)",7.3500000000000014,"(ni ZO)",3.6599999999999966,"(ni ZO)",2.7600000000000051]
["SE21-2013avg","3.2 Sončne elektrarne - ostale 2013 avgust",null,"mikro - manjše od 50kW","SE21",null,null,null,null,null,null,null,null,null,null,null,null,null,null,119.91,0,119.91,119.91,0,119.91,{"$f":"+W130","v":119.91},{"$f":"+X130","v":0},{"$f":"+Z130+AA130","v":119.91},119.91,0,119.91,0.88,null,null,null,null,null,null,null,null,null,null,null,null,{"$f":"T130+U130","v":119.91},{"$f":"ROUND((T130+U130)-AF130*$H$326,2)","v":75.33},{"$f":"W130+X130","v":119.91},{"$f":"ROUND((W130+X130)-AF130*$G$326,2)","v":81.8},{"$f":"+Z130+AA130","v":119.91},{"$f":"ROUND((Z130+AA130)-AF130*$F$326,2)","v":85.02},119.91,87.45,null,"(ni podpore 2011/2)","(ni podpore 2011/2)","(ni podpore 2011/2)","(ni podpore 2011/2)",{"$f":"AU130-AS130","v":0},6.4699999999999989,0,3.2199999999999989,{"$f":"AY130-AW130","v":0},{"$f":"AZ130-AX130","v":2.4300000000000068}]
["SE22-2013avg","3.2 Sončne elektrarne - ostale 2013 avgust",null,"mala - manjše od 1MW","SE22",null,null,null,null,null,null,null,null,null,null,null,null,null,null,110.48,0,110.48,110.48,0,110.48,110.48,0,110.48,{"$f":"+Z131","v":110.48},{"$f":"+AA131","v":0},{"$f":"+AC131+AD131","v":110.48},0.88,null,null,null,null,null,null,null,null,null,null,null,null,{"$f":"T131+U131","v":110.48},65.900000000000006,{"$f":"W131+X131","v":110.48},72.37,{"$f":"+Z131+AA131","v":110.48},75.59,{"$f":"+AC131+AD131","v":110.48},{"$f":"ROUND((AC131+AD131)-AF131*$E$326,2)","v":78.02},null,"(ni podpore 2011/2)","(ni podpore 2011/2)","(ni podpore 2011/2)","(ni podpore 2011/2)",0,6.4699999999999989,{"$f":"AW131-AU131","v":0},{"$f":"AX131-AV131","v":3.2199999999999989},0,2.4299999999999926]
["SE23-2013avg","3.2 Sončne elektrarne - ostale 2013 avgust",null,"srednja - od 1MW do vključno 10MW ","SE23",null,null,null,null,null,null,null,null,null,null,null,null,null,null,89.07,0,89.07,89.07,0,89.07,89.07,0,89.07,89.07,0,89.07,0.91,null,null,null,null,null,null,null,null,null,null,null,null,{"$f":"T132+U132","v":89.07},42.97,{"$f":"W132+X132","v":89.07},49.66,{"$f":"+Z132+AA132","v":89.07},52.99,89.07,55.5,null,"(ni podpore 2011/2)","(ni podpore 2011/2)","(ni podpore 2011/2)","(ni podpore 2011/2)",0,6.6899999999999977,0,3.3300000000000054,0,2.509999999999998]
["SE24-2013avg","3.2 Sončne elektrarne - ostale 2013 avgust",null,"velika - nad 10MW do vključno 125MW","SE24",null,null,null,null,null,null,null,null,null,null,null,null,null,null,82.69,0,82.69,82.69,0,82.69,82.69,0,82.69,82.69,0,82.69,1,null,null,null,null,null,null,null,null,null,null,null,null,"(ni ZO)",32.03,"(ni ZO)",39.380000000000003,"(ni ZO)",43.04,"(ni ZO)",45.8,null,"(ni podpore 2011/2)","(ni podpore 2011/2)","(ni podpore 2011/2)","(ni podpore 2011/2)","(ni ZO)",7.3500000000000014,"(ni ZO)",3.6599999999999966,"(ni ZO)",2.759999999999998]
["SE11-2013sep","3.1 Sončne elektrarne - na stavbah 2013 september",null,"mikro - manjše od 50kW","SE11",null,null,null,null,null,null,null,null,null,null,null,null,null,null,125.07,0,{"$f":"T134+U134","v":125.07},125.07,0,125.07,125.07,0,125.07,125.07,0,125.07,0.88,null,null,null,null,null,null,null,null,null,null,null,null,{"$f":"T134+U134","v":125.07},80.489999999999995,{"$f":"W134+X134","v":125.07},86.96,{"$f":"+Z134+AA134","v":125.07},90.18,125.07,92.61,null,"(ni podpore 2011/2)","(ni podpore 2011/2)","(ni podpore 2011/2)","(ni podpore 2011/2)",{"$f":"AU134-AS134","v":0},6.4699999999999989,0,3.2200000000000131,0,2.4299999999999926]
["SE12-2013sep","3.1 Sončne elektrarne - na stavbah 2013 september",null,"mala - manjše od 1MW","SE12",null,null,null,null,null,null,null,null,null,null,null,null,null,null,{"$f":"ROUND(0.98*T127,2)","v":114.39},0,114.39,{"$f":"ROUND(0.98*W127,2)","v":114.39},0,114.39,114.39,0,114.39,114.39,0,114.39,0.88,null,null,null,null,null,null,null,null,null,null,null,null,{"$f":"T135+U135","v":114.39},69.81,{"$f":"W135+X135","v":114.39},76.28,{"$f":"+Z135+AA135","v":114.39},79.5,114.39,81.93,null,"(ni podpore 2011/2)","(ni podpore 2011/2)","(ni podpore 2011/2)","(ni podpore 2011/2)",0,6.4699999999999989,0,3.2199999999999989,0,2.4300000000000068]
["SE13-2013sep","3.1 Sončne elektrarne - na stavbah 2013 september",null,"srednja - od 1MW do vključno 10MW ","SE13",null,null,null,null,null,null,null,null,null,null,null,null,null,null,94.91,0,94.91,94.91,0,94.91,94.91,0,94.91,94.91,0,94.91,0.91,null,null,null,null,null,null,null,null,null,null,null,null,{"$f":"T136+U136","v":94.91},48.81,{"$f":"W136+X136","v":94.91},55.5,{"$f":"+Z136+AA136","v":94.91},58.83,94.91,61.34,null,"(ni podpore 2011/2)","(ni podpore 2011/2)","(ni podpore 2011/2)","(ni podpore 2011/2)",0,6.6899999999999977,0,3.3299999999999983,0,2.5100000000000051]
["SE14-2013sep","3.1 Sončne elektrarne - na stavbah 2013 september",null,"velika - nad 10MW do vključno 125MW","SE14",null,null,null,null,null,null,null,null,null,null,null,null,null,null,84.48,0,84.48,84.48,0,84.48,84.48,0,84.48,84.48,0,84.48,1,null,null,null,null,null,null,null,null,null,null,null,null,"(ni ZO)",33.82,"(ni ZO)",41.17,"(ni ZO)",44.83,"(ni ZO)",47.59,null,"(ni podpore 2011/2)","(ni podpore 2011/2)","(ni podpore 2011/2)","(ni podpore 2011/2)","(ni ZO)",7.3500000000000014,"(ni ZO)",3.6599999999999966,"(ni ZO)",2.7600000000000051]
["SE21-2013sep","3.2 Sončne elektrarne - ostale 2013 september",null,"mikro - manjše od 50kW","SE21",null,null,null,null,null,null,null,null,null,null,null,null,null,null,117.51,0,117.51,117.51,0,117.51,117.51,0,117.51,117.51,0,117.51,0.88,null,null,null,null,null,null,null,null,null,null,null,null,{"$f":"T138+U138","v":117.51},72.930000000000007,{"$f":"W138+X138","v":117.51},79.400000000000006,{"$f":"+Z138+AA138","v":117.51},82.62,117.51,85.05,null,"(ni podpore 2011/2)","(ni podpore 2011/2)","(ni podpore 2011/2)","(ni podpore 2011/2)",{"$f":"AU138-AS138","v":0},6.4699999999999989,0,3.2199999999999989,0,2.4299999999999926]
["SE22-2013sep","3.2 Sončne elektrarne - ostale 2013 september",null,"mala - manjše od 1MW","SE22",null,null,null,null,null,null,null,null,null,null,null,null,null,null,108.27,0,108.27,108.27,0,108.27,108.27,0,108.27,108.27,0,108.27,0.88,null,null,null,null,null,null,null,null,null,null,null,null,{"$f":"T139+U139","v":108.27},63.69,{"$f":"W139+X139","v":108.27},70.16,{"$f":"+Z139+AA139","v":108.27},73.38,108.27,75.81,null,"(ni podpore 2011/2)","(ni podpore 2011/2)","(ni podpore 2011/2)","(ni podpore 2011/2)",0,6.4699999999999989,0,3.2199999999999989,0,2.4300000000000068]
["SE23-2013sep","3.2 Sončne elektrarne - ostale 2013 september",null,"srednja - od 1MW do vključno 10MW ","SE23",null,null,null,null,null,null,null,null,null,null,null,null,null,null,87.29,0,87.29,87.29,0,87.29,87.29,0,87.29,87.29,0,87.29,0.91,null,null,null,null,null,null,null,null,null,null,null,null,{"$f":"T140+U140","v":87.29},41.19,{"$f":"W140+X140","v":87.29},47.88,{"$f":"+Z140+AA140","v":87.29},51.21,87.29,53.72,null,"(ni podpore 2011/2)","(ni podpore 2011/2)","(ni podpore 2011/2)","(ni podpore 2011/2)",0,6.6900000000000048,0,3.3299999999999983,0,2.509999999999998]
["SE24-2013sep","3.2 Sončne elektrarne - ostale 2013 september",null,"velika - nad 10MW do vključno 125MW","SE24",null,null,null,null,null,null,null,null,null,null,null,null,null,null,81.040000000000006,0,81.040000000000006,81.040000000000006,0,81.040000000000006,81.040000000000006,0,81.040000000000006,81.040000000000006,0,81.040000000000006,1,null,null,null,null,null,null,null,null,null,null,null,null,"(ni ZO)",30.38,"(ni ZO)",37.729999999999997,"(ni ZO)",41.39,"(ni ZO)",44.15,null,"(ni podpore 2011/2)","(ni podpore 2011/2)","(ni podpore 2011/2)","(ni podpore 2011/2)","(ni ZO)",7.3499999999999979,"(ni ZO)",3.6600000000000037,"(ni ZO)",2.759999999999998]
["SE11-2013okt","3.1 Sončne elektrarne - na stavbah 2013 oktober",null,"mikro - manjše od 50kW","SE11",null,null,null,null,null,null,null,null,null,null,null,null,null,null,122.57,0,122.57,122.57,0,122.57,122.57,0,122.57,122.57,0,122.57,0.88,null,null,null,null,null,null,null,null,null,null,null,null,{"$f":"T142+U142","v":122.57},77.989999999999995,{"$f":"W142+X142","v":122.57},84.46,{"$f":"+Z142+AA142","v":122.57},87.68,122.57,90.11,null,"(ni podpore 2011/2)","(ni podpore 2011/2)","(ni podpore 2011/2)","(ni podpore 2011/2)",{"$f":"AU142-AS142","v":0},6.4699999999999989,0,3.2200000000000131,0,2.4299999999999926]
["SE12-2013okt","3.1 Sončne elektrarne - na stavbah 2013 oktober",null,"mala - manjše od 1MW","SE12",null,null,null,null,null,null,null,null,null,null,null,null,null,null,112.1,0,112.1,112.1,0,112.1,112.1,0,112.1,112.1,0,112.1,0.88,null,null,null,null,null,null,null,null,null,null,null,null,{"$f":"T143+U143","v":112.1},67.52,{"$f":"W143+X143","v":112.1},73.989999999999995,{"$f":"+Z143+AA143","v":112.1},77.209999999999994,112.1,79.64,null,"(ni podpore 2011/2)","(ni podpore 2011/2)","(ni podpore 2011/2)","(ni podpore 2011/2)",0,6.4699999999999989,0,3.2199999999999989,0,2.4300000000000068]
["SE13-2013okt","3.1 Sončne elektrarne - na stavbah 2013 oktober",null,"srednja - od 1MW do vključno 10MW ","SE13",null,null,null,null,null,null,null,null,null,null,null,null,null,null,93.01,0,93.01,93.01,0,93.01,93.01,0,93.01,93.01,0,93.01,0.91,null,null,null,null,null,null,null,null,null,null,null,null,{"$f":"T144+U144","v":93.01},46.91,{"$f":"W144+X144","v":93.01},53.6,{"$f":"+Z144+AA144","v":93.01},56.93,93.01,59.44,null,"(ni podpore 2011/2)","(ni podpore 2011/2)","(ni podpore 2011/2)","(ni podpore 2011/2)",0,6.6900000000000048,0,3.3299999999999983,0,2.509999999999998]
["SE14-2013okt","3.1 Sončne elektrarne - na stavbah 2013 oktober",null,"velika - nad 10MW do vključno 125MW","SE14",null,null,null,null,null,null,null,null,null,null,null,null,null,null,82.79,0,82.79,82.79,0,82.79,82.79,0,82.79,82.79,0,82.79,1,null,null,null,null,null,null,null,null,null,null,null,null,"(ni ZO)",32.130000000000003,"(ni ZO)",39.479999999999997,"(ni ZO)",43.14,"(ni ZO)",45.9,null,"(ni podpore 2011/2)","(ni podpore 2011/2)","(ni podpore 2011/2)","(ni podpore 2011/2)","(ni ZO)",7.3499999999999943,"(ni ZO)",3.6600000000000037,"(ni ZO)",2.759999999999998]
["SE21-2013okt","3.2 Sončne elektrarne - ostale 2013 oktober",null,"mikro - manjše od 50kW","SE21",null,null,null,null,null,null,null,null,null,null,null,null,null,null,115.16,0,115.16,115.16,0,115.16,115.16,0,115.16,115.16,0,115.16,0.88,null,null,null,null,null,null,null,null,null,null,null,null,{"$f":"T146+U146","v":115.16},70.58,{"$f":"W146+X146","v":115.16},77.05,{"$f":"+Z146+AA146","v":115.16},80.27,115.16,82.7,null,"(ni podpore 2011/2)","(ni podpore 2011/2)","(ni podpore 2011/2)","(ni podpore 2011/2)",{"$f":"AU146-AS146","v":0},6.4699999999999989,0,3.2199999999999989,0,2.4300000000000068]
["SE22-2013okt","3.2 Sončne elektrarne - ostale 2013 oktober",null,"mala - manjše od 1MW","SE22",null,null,null,null,null,null,null,null,null,null,null,null,null,null,106.1,0,106.1,106.1,0,106.1,106.1,0,106.1,106.1,0,106.1,0.88,null,null,null,null,null,null,null,null,null,null,null,null,{"$f":"T147+U147","v":106.1},61.52,{"$f":"W147+X147","v":106.1},67.989999999999995,{"$f":"+Z147+AA147","v":106.1},71.209999999999994,106.1,73.64,null,"(ni podpore 2011/2)","(ni podpore 2011/2)","(ni podpore 2011/2)","(ni podpore 2011/2)",0,6.4699999999999918,0,3.2199999999999989,0,2.4300000000000068]
["SE23-2013okt","3.2 Sončne elektrarne - ostale 2013 oktober",null,"srednja - od 1MW do vključno 10MW ","SE23",null,null,null,null,null,null,null,null,null,null,null,null,null,null,85.54,0,85.54,85.54,0,85.54,85.54,0,85.54,85.54,0,85.54,0.91,null,null,null,null,null,null,null,null,null,null,null,null,{"$f":"T148+U148","v":85.54},39.44,{"$f":"W148+X148","v":85.54},46.13,{"$f":"+Z148+AA148","v":85.54},49.46,85.54,51.97,null,"(ni podpore 2011/2)","(ni podpore 2011/2)","(ni podpore 2011/2)","(ni podpore 2011/2)",0,6.6900000000000048,0,3.3299999999999983,0,2.509999999999998]
["SE24-2013okt","3.2 Sončne elektrarne - ostale 2013 oktober",null,"velika - nad 10MW do vključno 125MW","SE24",null,null,null,null,null,null,null,null,null,null,null,null,null,null,79.42,0,79.42,79.42,0,79.42,79.42,0,79.42,79.42,0,79.42,1,null,null,null,null,null,null,null,null,null,null,null,null,"(ni ZO)",28.76,"(ni ZO)",36.11,"(ni ZO)",39.770000000000003,"(ni ZO)",42.53,null,"(ni podpore 2011/2)","(ni podpore 2011/2)","(ni podpore 2011/2)","(ni podpore 2011/2)","(ni ZO)",7.3499999999999979,"(ni ZO)",3.6600000000000037,"(ni ZO)",2.759999999999998]
["SE11-2013nov","3.1 Sončne elektrarne - na stavbah 2013 november",null,"mikro - manjše od 50kW","SE11",null,null,null,null,null,null,null,null,null,null,null,null,null,null,120.12,0,120.12,120.12,0,120.12,120.12,0,120.12,120.12,0,120.12,0.88,null,null,null,null,null,null,null,null,null,null,null,null,{"$f":"T150+U150","v":120.12},75.540000000000006,{"$f":"W150+X150","v":120.12},82.01,{"$f":"+Z150+AA150","v":120.12},85.23,120.12,87.66,null,"(ni podpore 2011/2)","(ni podpore 2011/2)","(ni podpore 2011/2)","(ni podpore 2011/2)",{"$f":"AU150-AS150","v":0},6.4699999999999989,0,3.2199999999999989,0,2.4299999999999926]
["SE12-2013nov","3.1 Sončne elektrarne - na stavbah 2013 november",null,"mala - manjše od 1MW","SE12",null,null,null,null,null,null,null,null,null,null,null,null,null,null,109.86,0,109.86,109.86,0,109.86,109.86,0,109.86,109.86,0,109.86,0.88,null,null,null,null,null,null,null,null,null,null,null,null,{"$f":"T151+U151","v":109.86},65.28,{"$f":"W151+X151","v":109.86},71.75,{"$f":"+Z151+AA151","v":109.86},74.97,109.86,77.400000000000006,null,"(ni podpore 2011/2)","(ni podpore 2011/2)","(ni podpore 2011/2)","(ni podpore 2011/2)",0,6.4699999999999989,0,3.2199999999999989,0,2.4300000000000068]
["SE13-2013nov","3.1 Sončne elektrarne - na stavbah 2013 november",null,"srednja - od 1MW do vključno 10MW ","SE13",null,null,null,null,null,null,null,null,null,null,null,null,null,null,91.15,0,91.15,91.15,0,91.15,91.15,0,91.15,91.15,0,91.15,0.91,null,null,null,null,null,null,null,null,null,null,null,null,{"$f":"T152+U152","v":91.15},45.05,{"$f":"W152+X152","v":91.15},51.74,{"$f":"+Z152+AA152","v":91.15},55.07,91.15,57.58,null,"(ni podpore 2011/2)","(ni podpore 2011/2)","(ni podpore 2011/2)","(ni podpore 2011/2)",0,6.6900000000000048,0,3.3299999999999983,0,2.509999999999998]
["SE14-2013nov","3.1 Sončne elektrarne - na stavbah 2013 november",null,"velika - nad 10MW do vključno 125MW","SE14",null,null,null,null,null,null,null,null,null,null,null,null,null,null,81.13,0,81.13,81.13,0,81.13,81.13,0,81.13,81.13,0,81.13,1,null,null,null,null,null,null,null,null,null,null,null,null,"(ni ZO)",30.47,"(ni ZO)",37.82,"(ni ZO)",41.48,"(ni ZO)",44.24,null,"(ni podpore 2011/2)","(ni podpore 2011/2)","(ni podpore 2011/2)","(ni podpore 2011/2)","(ni ZO)",7.3500000000000014,"(ni ZO)",3.6599999999999966,"(ni ZO)",2.7600000000000051]
["SE21-2013nov","3.2 Sončne elektrarne - ostale 2013 november",null,"mikro - manjše od 50kW","SE21",null,null,null,null,null,null,null,null,null,null,null,null,null,null,112.86,0,112.86,112.86,0,112.86,112.86,0,112.86,112.86,0,112.86,0.88,null,null,null,null,null,null,null,null,null,null,null,null,{"$f":"T154+U154","v":112.86},68.28,{"$f":"W154+X154","v":112.86},74.75,{"$f":"+Z154+AA154","v":112.86},77.97,112.86,80.400000000000006,null,"(ni podpore 2011/2)","(ni podpore 2011/2)","(ni podpore 2011/2)","(ni podpore 2011/2)",{"$f":"AU154-AS154","v":0},6.4699999999999989,0,3.2199999999999989,0,2.4300000000000068]
["SE22-2013nov","3.2 Sončne elektrarne - ostale 2013 november",null,"mala - manjše od 1MW","SE22",null,null,null,null,null,null,null,null,null,null,null,null,null,null,103.98,0,103.98,103.98,0,103.98,103.98,0,103.98,103.98,0,103.98,0.88,null,null,null,null,null,null,null,null,null,null,null,null,{"$f":"T155+U155","v":103.98},59.4,{"$f":"W155+X155","v":103.98},65.87,{"$f":"+Z155+AA155","v":103.98},69.09,103.98,71.52,null,"(ni podpore 2011/2)","(ni podpore 2011/2)","(ni podpore 2011/2)","(ni podpore 2011/2)",0,6.470000000000006,0,3.2199999999999989,0,2.4299999999999926]
["SE23-2013nov","3.2 Sončne elektrarne - ostale 2013 november",null,"srednja - od 1MW do vključno 10MW ","SE23",null,null,null,null,null,null,null,null,null,null,null,null,null,null,83.83,0,83.83,83.83,0,83.83,83.83,0,83.83,83.83,0,83.83,0.91,null,null,null,null,null,null,null,null,null,null,null,null,{"$f":"T156+U156","v":83.83},37.729999999999997,{"$f":"W156+X156","v":83.83},44.42,{"$f":"+Z156+AA156","v":83.83},47.75,83.83,50.26,null,"(ni podpore 2011/2)","(ni podpore 2011/2)","(ni podpore 2011/2)","(ni podpore 2011/2)",0,6.6900000000000048,0,3.3299999999999983,0,2.509999999999998]
["SE24-2013nov","3.2 Sončne elektrarne - ostale 2013 november",null,"velika - nad 10MW do vključno 125MW","SE24",null,null,null,null,null,null,null,null,null,null,null,null,null,null,77.83,0,77.83,77.83,0,77.83,77.83,0,77.83,77.83,0,77.83,1,null,null,null,null,null,null,null,null,null,null,null,null,"(ni ZO)",27.17,"(ni ZO)",34.520000000000003,"(ni ZO)",38.18,"(ni ZO)",40.94,null,"(ni podpore 2011/2)","(ni podpore 2011/2)","(ni podpore 2011/2)","(ni podpore 2011/2)","(ni ZO)",7.3500000000000014,"(ni ZO)",3.6599999999999966,"(ni ZO)",2.759999999999998]
["SE11-2013dec","3.1 Sončne elektrarne - na stavbah 2013 december",null,"mikro - manjše od 50kW","SE11",null,null,null,null,null,null,null,null,null,null,null,null,null,null,117.72,0,117.72,117.72,0,117.72,117.72,0,117.72,117.72,0,117.72,0.88,null,null,null,null,null,null,null,null,null,null,null,null,{"$f":"T158+U158","v":117.72},73.14,{"$f":"W158+X158","v":117.72},79.61,{"$f":"+Z158+AA158","v":117.72},82.83,117.72,85.26,null,"(ni podpore 2011/2)","(ni podpore 2011/2)","(ni podpore 2011/2)","(ni podpore 2011/2)",{"$f":"AU158-AS158","v":0},6.4699999999999989,0,3.2199999999999989,0,2.4300000000000068]
["SE12-2013dec","3.1 Sončne elektrarne - na stavbah 2013 december",null,"mala - manjše od 1MW","SE12",null,null,null,null,null,null,null,null,null,null,null,null,null,null,107.66,0,107.66,107.66,0,107.66,107.66,0,107.66,107.66,0,107.66,0.88,null,null,null,null,null,null,null,null,null,null,null,null,{"$f":"T159+U159","v":107.66},63.08,{"$f":"W159+X159","v":107.66},69.55,{"$f":"+Z159+AA159","v":107.66},72.77,107.66,75.2,null,"(ni podpore 2011/2)","(ni podpore 2011/2)","(ni podpore 2011/2)","(ni podpore 2011/2)",0,6.4699999999999989,0,3.2199999999999989,0,2.4300000000000068]
["SE13-2013dec","3.1 Sončne elektrarne - na stavbah 2013 december",null,"srednja - od 1MW do vključno 10MW ","SE13",null,null,null,null,null,null,null,null,null,null,null,null,null,null,89.33,0,89.33,89.33,0,89.33,89.33,0,89.33,89.33,0,89.33,0.91,null,null,null,null,null,null,null,null,null,null,null,null,{"$f":"T160+U160","v":89.33},43.23,{"$f":"W160+X160","v":89.33},49.92,{"$f":"+Z160+AA160","v":89.33},53.25,89.33,55.76,null,"(ni podpore 2011/2)","(ni podpore 2011/2)","(ni podpore 2011/2)","(ni podpore 2011/2)",0,6.6900000000000048,0,3.3299999999999983,0,2.509999999999998]
["SE14-2013dec","3.1 Sončne elektrarne - na stavbah 2013 december",null,"velika - nad 10MW do vključno 125MW","SE14",null,null,null,null,null,null,null,null,null,null,null,null,null,null,79.510000000000005,0,79.510000000000005,79.510000000000005,0,79.510000000000005,79.510000000000005,0,79.510000000000005,79.510000000000005,0,79.510000000000005,1,null,null,null,null,null,null,null,null,null,null,null,null,"(ni ZO)",28.85,"(ni ZO)",36.200000000000003,"(ni ZO)",39.86,"(ni ZO)",42.62,null,"(ni podpore 2011/2)","(ni podpore 2011/2)","(ni podpore 2011/2)","(ni podpore 2011/2)","(ni ZO)",7.3500000000000014,"(ni ZO)",3.6599999999999966,"(ni ZO)",2.759999999999998]
["SE21-2013dec","3.2 Sončne elektrarne - ostale 2013 december",null,"mikro - manjše od 50kW","SE21",null,null,null,null,null,null,null,null,null,null,null,null,null,null,110.6,0,110.6,110.6,0,110.6,110.6,0,110.6,110.6,0,110.6,0.88,null,null,null,null,null,null,null,null,null,null,null,null,{"$f":"T162+U162","v":110.6},66.02,{"$f":"W162+X162","v":110.6},72.489999999999995,{"$f":"+Z162+AA162","v":110.6},75.709999999999994,110.6,78.14,null,"(ni podpore 2011/2)","(ni podpore 2011/2)","(ni podpore 2011/2)","(ni podpore 2011/2)",{"$f":"AU162-AS162","v":0},6.4699999999999989,0,3.2199999999999989,0,2.4300000000000068]
["SE22-2013dec","3.2 Sončne elektrarne - ostale 2013 december",null,"mala - manjše od 1MW","SE22",null,null,null,null,null,null,null,null,null,null,null,null,null,null,101.9,0,101.9,101.9,0,101.9,101.9,0,101.9,101.9,0,101.9,0.88,null,null,null,null,null,null,null,null,null,null,null,null,{"$f":"T163+U163","v":101.9},57.32,{"$f":"W163+X163","v":101.9},63.79,{"$f":"+Z163+AA163","v":101.9},67.010000000000005,101.9,69.44,null,"(ni podpore 2011/2)","(ni podpore 2011/2)","(ni podpore 2011/2)","(ni podpore 2011/2)",0,6.4699999999999989,0,3.220000000000006,0,2.4299999999999926]
["SE23-2013dec","3.2 Sončne elektrarne - ostale 2013 december",null,"srednja - od 1MW do vključno 10MW ","SE23",null,null,null,null,null,null,null,null,null,null,null,null,null,null,82.15,0,82.15,82.15,0,82.15,82.15,0,82.15,82.15,0,82.15,0.91,null,null,null,null,null,null,null,null,null,null,null,null,{"$f":"T164+U164","v":82.15},36.049999999999997,{"$f":"W164+X164","v":82.15},42.74,{"$f":"+Z164+AA164","v":82.15},46.07,82.15,48.58,null,"(ni podpore 2011/2)","(ni podpore 2011/2)","(ni podpore 2011/2)","(ni podpore 2011/2)",0,6.6900000000000048,0,3.3299999999999983,0,2.509999999999998]
["SE24-2013dec","3.2 Sončne elektrarne - ostale 2013 december",null,"velika - nad 10MW do vključno 125MW","SE24",null,null,null,null,null,null,null,null,null,null,null,null,null,null,76.27,0,76.27,76.27,0,76.27,76.27,0,76.27,76.27,0,76.27,1,null,null,null,null,null,null,null,null,null,null,null,null,"(ni ZO)",25.61,"(ni ZO)",32.96,"(ni ZO)",36.619999999999997,"(ni ZO)",39.380000000000003,null,"(ni podpore 2011/2)","(ni podpore 2011/2)","(ni podpore 2011/2)","(ni podpore 2011/2)","(ni ZO)",7.3500000000000014,"(ni ZO)",3.6599999999999966,"(ni ZO)",2.7600000000000051]
["SE11-2014jan","3.1 Sončne elektrarne - na stavbah 2014 januar",null,"mikro - manjše od 50kW","SE11",null,null,null,null,null,null,null,null,null,null,null,null,null,null,null,null,null,115.37,0,{"$f":"W166+X166","v":115.37},115.37,0,115.37,115.37,0,115.37,0.88,null,null,null,null,null,null,null,null,null,null,null,null,null,null,{"$f":"W166+X166","v":115.37},77.260000000000005,{"$f":"+Z166+AA166","v":115.37},80.48,115.37,82.91,null,"(ni podpore 2011/2)","(ni podpore 2011/2)","(ni podpore 2011/2)","(ni podpore 2011/2)","(ni podpore 2013)","(ni podpore 2013)",0,3.2199999999999989,0,2.4299999999999926]
["SE12-2014jan","3.1 Sončne elektrarne - na stavbah 2014 januar",null,"mala - manjše od 1MW","SE12",null,null,null,null,null,null,null,null,null,null,null,null,null,null,null,null,null,105.51,0,105.51,105.51,0,105.51,105.51,0,105.51,0.88,null,null,null,null,null,null,null,null,null,null,null,null,null,null,{"$f":"W167+X167","v":105.51},67.400000000000006,{"$f":"+Z167+AA167","v":105.51},70.62,105.51,73.05,null,"(ni podpore 2011/2)","(ni podpore 2011/2)","(ni podpore 2011/2)","(ni podpore 2011/2)","(ni podpore 2013)","(ni podpore 2013)",0,3.2199999999999989,0,2.4299999999999926]
["SE13-2014jan","3.1 Sončne elektrarne - na stavbah 2014 januar",null,"srednja - od 1MW do vključno 10MW ","SE13",null,null,null,null,null,null,null,null,null,null,null,null,null,null,null,null,null,87.54,0,87.54,87.54,0,87.54,87.54,0,87.54,0.91,null,null,null,null,null,null,null,null,null,null,null,null,null,null,{"$f":"W168+X168","v":87.54},48.13,{"$f":"+Z168+AA168","v":87.54},51.46,87.54,53.97,null,"(ni podpore 2011/2)","(ni podpore 2011/2)","(ni podpore 2011/2)","(ni podpore 2011/2)","(ni podpore 2013)","(ni podpore 2013)",0,3.3299999999999983,0,2.509999999999998]
["SE14-2014jan","3.1 Sončne elektrarne - na stavbah 2014 januar",null,"velika - nad 10MW do vključno 125MW","SE14",null,null,null,null,null,null,null,null,null,null,null,null,null,null,null,null,null,77.92,0,77.92,77.92,0,77.92,77.92,0,77.92,1,null,null,null,null,null,null,null,null,null,null,null,null,null,null,"(ni ZO)",34.61,"(ni ZO)",38.270000000000003,"(ni ZO)",41.03,null,"(ni podpore 2011/2)","(ni podpore 2011/2)","(ni podpore 2011/2)","(ni podpore 2011/2)","(ni podpore 2013)","(ni podpore 2013)","(ni ZO)",3.6600000000000037,"(ni ZO)",2.759999999999998]
["SE21-2014jan","3.2 Sončne elektrarne - ostale 2014 januar",null,"mikro - manjše od 50kW","SE21",null,null,null,null,null,null,null,null,null,null,null,null,null,null,null,null,null,108.39,0,108.39,108.39,0,108.39,108.39,0,108.39,0.88,null,null,null,null,null,null,null,null,null,null,null,null,null,null,{"$f":"W170+X170","v":108.39},70.28,{"$f":"+Z170+AA170","v":108.39},73.5,108.39,75.930000000000007,null,"(ni podpore 2011/2)","(ni podpore 2011/2)","(ni podpore 2011/2)","(ni podpore 2011/2)","(ni podpore 2013)","(ni podpore 2013)",0,3.2199999999999989,0,2.4300000000000068]
["SE22-2014jan","3.2 Sončne elektrarne - ostale 2014 januar",null,"mala - manjše od 1MW","SE22",null,null,null,null,null,null,null,null,null,null,null,null,null,null,null,null,null,99.86,0,99.86,99.86,0,99.86,99.86,0,99.86,0.88,null,null,null,null,null,null,null,null,null,null,null,null,null,null,{"$f":"W171+X171","v":99.86},61.75,{"$f":"+Z171+AA171","v":99.86},64.97,99.86,67.400000000000006,null,"(ni podpore 2011/2)","(ni podpore 2011/2)","(ni podpore 2011/2)","(ni podpore 2011/2)","(ni podpore 2013)","(ni podpore 2013)",0,3.2199999999999989,0,2.4300000000000068]
["SE23-2014jan","3.2 Sončne elektrarne - ostale 2014 januar",null,"srednja - od 1MW do vključno 10MW ","SE23",null,null,null,null,null,null,null,null,null,null,null,null,null,null,null,null,null,80.510000000000005,0,80.510000000000005,80.510000000000005,0,80.510000000000005,80.510000000000005,0,80.510000000000005,0.91,null,null,null,null,null,null,null,null,null,null,null,null,null,null,{"$f":"W172+X172","v":80.510000000000005},41.1,{"$f":"+Z172+AA172","v":80.510000000000005},44.43,80.510000000000005,46.94,null,"(ni podpore 2011/2)","(ni podpore 2011/2)","(ni podpore 2011/2)","(ni podpore 2011/2)","(ni podpore 2013)","(ni podpore 2013)",0,3.3299999999999983,0,2.509999999999998]
["SE24-2014jan","3.2 Sončne elektrarne - ostale 2014 januar",null,"velika - nad 10MW do vključno 125MW","SE24",null,null,null,null,null,null,null,null,null,null,null,null,null,null,null,null,null,74.739999999999995,0,74.739999999999995,74.739999999999995,0,74.739999999999995,74.739999999999995,0,74.739999999999995,1,null,null,null,null,null,null,null,null,null,null,null,null,null,null,"(ni ZO)",31.43,"(ni ZO)",35.090000000000003,"(ni ZO)",37.85,null,"(ni podpore 2011/2)","(ni podpore 2011/2)","(ni podpore 2011/2)","(ni podpore 2011/2)","(ni podpore 2013)","(ni podpore 2013)","(ni ZO)",3.6600000000000037,"(ni ZO)",2.759999999999998]
["SE11-2014feb","3.1 Sončne elektrarne - na stavbah 2014 februar",null,"mikro - manjše od 50kW","SE11",null,null,null,null,null,null,null,null,null,null,null,null,null,null,null,null,null,113.06,0,113.06,113.06,0,113.06,113.06,0,113.06,0.88,null,null,null,null,null,null,null,null,null,null,null,null,null,null,{"$f":"W174+X174","v":113.06},74.95,{"$f":"+Z174+AA174","v":113.06},78.17,113.06,80.599999999999994,null,"(ni podpore 2011/2)","(ni podpore 2011/2)","(ni podpore 2011/2)","(ni podpore 2011/2)","(ni podpore 2013)","(ni podpore 2013)",0,3.2199999999999989,0,2.4299999999999926]
["SE12-2014feb","3.1 Sončne elektrarne - na stavbah 2014 februar",null,"mala - manjše od 1MW","SE12",null,null,null,null,null,null,null,null,null,null,null,null,null,null,null,null,null,103.4,0,103.4,103.4,0,103.4,103.4,0,103.4,0.88,null,null,null,null,null,null,null,null,null,null,null,null,null,null,{"$f":"W175+X175","v":103.4},65.290000000000006,{"$f":"+Z175+AA175","v":103.4},68.510000000000005,103.4,70.94,null,"(ni podpore 2011/2)","(ni podpore 2011/2)","(ni podpore 2011/2)","(ni podpore 2011/2)","(ni podpore 2013)","(ni podpore 2013)",0,3.2199999999999989,0,2.4299999999999926]
["SE13-2014feb","3.1 Sončne elektrarne - na stavbah 2014 februar",null,"srednja - od 1MW do vključno 10MW ","SE13",null,null,null,null,null,null,null,null,null,null,null,null,null,null,null,null,null,85.79,0,85.79,85.79,0,85.79,85.79,0,85.79,0.91,null,null,null,null,null,null,null,null,null,null,null,null,null,null,{"$f":"W176+X176","v":85.79},46.38,{"$f":"+Z176+AA176","v":85.79},49.71,85.79,52.22,null,"(ni podpore 2011/2)","(ni podpore 2011/2)","(ni podpore 2011/2)","(ni podpore 2011/2)","(ni podpore 2013)","(ni podpore 2013)",0,3.3299999999999983,0,2.509999999999998]
["SE14-2014feb","3.1 Sončne elektrarne - na stavbah 2014 februar",null,"velika - nad 10MW do vključno 125MW","SE14",null,null,null,null,null,null,null,null,null,null,null,null,null,null,null,null,null,76.36,0,76.36,76.36,0,76.36,76.36,0,76.36,1,null,null,null,null,null,null,null,null,null,null,null,null,null,null,"(ni ZO)",33.049999999999997,"(ni ZO)",36.71,"(ni ZO)",39.47,null,"(ni podpore 2011/2)","(ni podpore 2011/2)","(ni podpore 2011/2)","(ni podpore 2011/2)","(ni podpore 2013)","(ni podpore 2013)","(ni ZO)",3.6600000000000037,"(ni ZO)",2.759999999999998]
["SE21-2014feb","3.2 Sončne elektrarne - ostale 2014 februar",null,"mikro - manjše od 50kW","SE21",null,null,null,null,null,null,null,null,null,null,null,null,null,null,null,null,null,106.22,0,106.22,106.22,0,106.22,106.22,0,106.22,0.88,null,null,null,null,null,null,null,null,null,null,null,null,null,null,{"$f":"W178+X178","v":106.22},68.11,{"$f":"+Z178+AA178","v":106.22},71.33,106.22,73.760000000000005,null,"(ni podpore 2011/2)","(ni podpore 2011/2)","(ni podpore 2011/2)","(ni podpore 2011/2)","(ni podpore 2013)","(ni podpore 2013)",0,3.2199999999999989,0,2.4300000000000068]
["SE22-2014feb","3.2 Sončne elektrarne - ostale 2014 februar",null,"mala - manjše od 1MW","SE22",null,null,null,null,null,null,null,null,null,null,null,null,null,null,null,null,null,97.86,0,97.86,97.86,0,97.86,97.86,0,97.86,0.88,null,null,null,null,null,null,null,null,null,null,null,null,null,null,{"$f":"W179+X179","v":97.86},59.75,{"$f":"+Z179+AA179","v":97.86},62.97,97.86,65.400000000000006,null,"(ni podpore 2011/2)","(ni podpore 2011/2)","(ni podpore 2011/2)","(ni podpore 2011/2)","(ni podpore 2013)","(ni podpore 2013)",0,3.2199999999999989,0,2.4300000000000068]
["SE23-2014feb","3.2 Sončne elektrarne - ostale 2014 februar",null,"srednja - od 1MW do vključno 10MW ","SE23",null,null,null,null,null,null,null,null,null,null,null,null,null,null,null,null,null,78.900000000000006,0,78.900000000000006,78.900000000000006,0,78.900000000000006,78.900000000000006,0,78.900000000000006,0.91,null,null,null,null,null,null,null,null,null,null,null,null,null,null,{"$f":"W180+X180","v":78.900000000000006},39.49,{"$f":"+Z180+AA180","v":78.900000000000006},42.82,78.900000000000006,45.33,null,"(ni podpore 2011/2)","(ni podpore 2011/2)","(ni podpore 2011/2)","(ni podpore 2011/2)","(ni podpore 2013)","(ni podpore 2013)",0,3.3299999999999983,0,2.509999999999998]
["SE24-2014feb","3.2 Sončne elektrarne - ostale 2014 februar",null,"velika - nad 10MW do vključno 125MW","SE24",null,null,null,null,null,null,null,null,null,null,null,null,null,null,null,null,null,73.25,0,73.25,73.25,0,73.25,73.25,0,73.25,1,null,null,null,null,null,null,null,null,null,null,null,null,null,null,"(ni ZO)",29.94,"(ni ZO)",33.6,"(ni ZO)",36.36,null,"(ni podpore 2011/2)","(ni podpore 2011/2)","(ni podpore 2011/2)","(ni podpore 2011/2)","(ni podpore 2013)","(ni podpore 2013)","(ni ZO)",3.66,"(ni ZO)",2.759999999999998]
["SE11-2014mar","3.1 Sončne elektrarne - na stavbah 2014 marec",null,"mikro - manjše od 50kW","SE11",null,null,null,null,null,null,null,null,null,null,null,null,null,null,null,null,null,110.8,0,110.8,110.8,0,110.8,110.8,0,110.8,0.88,null,null,null,null,null,null,null,null,null,null,null,null,null,null,{"$f":"W182+X182","v":110.8},72.69,{"$f":"+Z182+AA182","v":110.8},75.91,110.8,78.34,null,"(ni podpore 2011/2)","(ni podpore 2011/2)","(ni podpore 2011/2)","(ni podpore 2011/2)","(ni podpore 2013)","(ni podpore 2013)",0,3.2199999999999989,0,2.4300000000000068]
["SE12-2014mar","3.1 Sončne elektrarne - na stavbah 2014 marec",null,"mala - manjše od 1MW","SE12",null,null,null,null,null,null,null,null,null,null,null,null,null,null,null,null,null,101.33,0,101.33,101.33,0,101.33,101.33,0,101.33,0.88,null,null,null,null,null,null,null,null,null,null,null,null,null,null,{"$f":"W183+X183","v":101.33},63.22,{"$f":"+Z183+AA183","v":101.33},66.44,101.33,68.87,null,"(ni podpore 2011/2)","(ni podpore 2011/2)","(ni podpore 2011/2)","(ni podpore 2011/2)","(ni podpore 2013)","(ni podpore 2013)",0,3.2199999999999989,0,2.4300000000000068]
["SE13-2014mar","3.1 Sončne elektrarne - na stavbah 2014 marec",null,"srednja - od 1MW do vključno 10MW ","SE13",null,null,null,null,null,null,null,null,null,null,null,null,null,null,null,null,null,84.07,0,84.07,84.07,0,84.07,84.07,0,84.07,0.91,null,null,null,null,null,null,null,null,null,null,null,null,null,null,{"$f":"W184+X184","v":84.07},44.66,{"$f":"+Z184+AA184","v":84.07},47.99,84.07,50.5,null,"(ni podpore 2011/2)","(ni podpore 2011/2)","(ni podpore 2011/2)","(ni podpore 2011/2)","(ni podpore 2013)","(ni podpore 2013)",0,3.3300000000000054,0,2.509999999999998]
["SE14-2014mar","3.1 Sončne elektrarne - na stavbah 2014 marec",null,"velika - nad 10MW do vključno 125MW","SE14",null,null,null,null,null,null,null,null,null,null,null,null,null,null,null,null,null,74.83,0,74.83,74.83,0,74.83,74.83,0,74.83,1,null,null,null,null,null,null,null,null,null,null,null,null,null,null,"(ni ZO)",31.52,"(ni ZO)",35.18,"(ni ZO)",37.94,null,"(ni podpore 2011/2)","(ni podpore 2011/2)","(ni podpore 2011/2)","(ni podpore 2011/2)","(ni podpore 2013)","(ni podpore 2013)","(ni ZO)",3.66,"(ni ZO)",2.759999999999998]
["SE21-2014mar","3.2 Sončne elektrarne - ostale 2014 marec",null,"mikro - manjše od 50kW","SE21",null,null,null,null,null,null,null,null,null,null,null,null,null,null,null,null,null,104.1,0,104.1,104.1,0,104.1,104.1,0,104.1,0.88,null,null,null,null,null,null,null,null,null,null,null,null,null,null,{"$f":"W186+X186","v":104.1},65.989999999999995,{"$f":"+Z186+AA186","v":104.1},69.209999999999994,104.1,71.64,null,"(ni podpore 2011/2)","(ni podpore 2011/2)","(ni podpore 2011/2)","(ni podpore 2011/2)","(ni podpore 2013)","(ni podpore 2013)",0,3.2199999999999989,0,2.4300000000000068]
["SE22-2014mar","3.2 Sončne elektrarne - ostale 2014 marec",null,"mala - manjše od 1MW","SE22",null,null,null,null,null,null,null,null,null,null,null,null,null,null,null,null,null,95.9,0,95.9,95.9,0,95.9,95.9,0,95.9,0.88,null,null,null,null,null,null,null,null,null,null,null,null,null,null,{"$f":"W187+X187","v":95.9},57.79,{"$f":"+Z187+AA187","v":95.9},61.01,95.9,63.44,null,"(ni podpore 2011/2)","(ni podpore 2011/2)","(ni podpore 2011/2)","(ni podpore 2011/2)","(ni podpore 2013)","(ni podpore 2013)",0,3.2199999999999989,0,2.4299999999999997]
["SE23-2014mar","3.2 Sončne elektrarne - ostale 2014 marec",null,"srednja - od 1MW do vključno 10MW ","SE23",null,null,null,null,null,null,null,null,null,null,null,null,null,null,null,null,null,77.319999999999993,0,77.319999999999993,77.319999999999993,0,77.319999999999993,77.319999999999993,0,77.319999999999993,0.91,null,null,null,null,null,null,null,null,null,null,null,null,null,null,{"$f":"W188+X188","v":77.319999999999993},37.909999999999997,{"$f":"+Z188+AA188","v":77.319999999999993},41.24,77.319999999999993,43.75,null,"(ni podpore 2011/2)","(ni podpore 2011/2)","(ni podpore 2011/2)","(ni podpore 2011/2)","(ni podpore 2013)","(ni podpore 2013)",0,3.3300000000000054,0,2.509999999999998]
["SE24-2014mar","3.2 Sončne elektrarne - ostale 2014 marec",null,"velika - nad 10MW do vključno 125MW","SE24",null,null,null,null,null,null,null,null,null,null,null,null,null,null,null,null,null,71.790000000000006,0,71.790000000000006,71.790000000000006,0,71.790000000000006,71.790000000000006,0,71.790000000000006,1,null,null,null,null,null,null,null,null,null,null,null,null,null,null,"(ni ZO)",28.48,"(ni ZO)",32.14,"(ni ZO)",34.9,null,"(ni podpore 2011/2)","(ni podpore 2011/2)","(ni podpore 2011/2)","(ni podpore 2011/2)","(ni podpore 2013)","(ni podpore 2013)","(ni ZO)",3.66,"(ni ZO)",2.759999999999998]
["SE11-2014apr","3.1 Sončne elektrarne - na stavbah 2014 april",null,"mikro - manjše od 50kW","SE11",null,null,null,null,null,null,null,null,null,null,null,null,null,null,null,null,null,108.58,0,108.58,108.58,0,108.58,108.58,0,108.58,0.88,null,null,null,null,null,null,null,null,null,null,null,null,null,null,{"$f":"W190+X190","v":108.58},70.47,{"$f":"+Z190+AA190","v":108.58},73.69,108.58,76.12,null,"(ni podpore 2011/2)","(ni podpore 2011/2)","(ni podpore 2011/2)","(ni podpore 2011/2)","(ni podpore 2013)","(ni podpore 2013)",0,3.2199999999999989,0,2.4300000000000068]
["SE12-2014apr","3.1 Sončne elektrarne - na stavbah 2014 april",null,"mala - manjše od 1MW","SE12",null,null,null,null,null,null,null,null,null,null,null,null,null,null,null,null,null,99.3,0,99.3,99.3,0,99.3,99.3,0,99.3,0.88,null,null,null,null,null,null,null,null,null,null,null,null,null,null,{"$f":"W191+X191","v":99.3},61.19,{"$f":"+Z191+AA191","v":99.3},64.41,99.3,66.84,null,"(ni podpore 2011/2)","(ni podpore 2011/2)","(ni podpore 2011/2)","(ni podpore 2011/2)","(ni podpore 2013)","(ni podpore 2013)",0,3.2199999999999989,0,2.4300000000000068]
["SE13-2014apr","3.1 Sončne elektrarne - na stavbah 2014 april",null,"srednja - od 1MW do vključno 10MW ","SE13",null,null,null,null,null,null,null,null,null,null,null,null,null,null,null,null,null,82.39,0,82.39,82.39,0,82.39,82.39,0,82.39,0.91,null,null,null,null,null,null,null,null,null,null,null,null,null,null,{"$f":"W192+X192","v":82.39},42.98,{"$f":"+Z192+AA192","v":82.39},46.31,82.39,48.82,null,"(ni podpore 2011/2)","(ni podpore 2011/2)","(ni podpore 2011/2)","(ni podpore 2011/2)","(ni podpore 2013)","(ni podpore 2013)",0,3.3300000000000054,0,2.509999999999998]
["SE14-2014apr","3.1 Sončne elektrarne - na stavbah 2014 april",null,"velika - nad 10MW do vključno 125MW","SE14",null,null,null,null,null,null,null,null,null,null,null,null,null,null,null,null,null,73.33,0,73.33,73.33,0,73.33,73.33,0,73.33,1,null,null,null,null,null,null,null,null,null,null,null,null,null,null,"(ni ZO)",30.02,"(ni ZO)",33.68,"(ni ZO)",36.44,null,"(ni podpore 2011/2)","(ni podpore 2011/2)","(ni podpore 2011/2)","(ni podpore 2011/2)","(ni podpore 2013)","(ni podpore 2013)","(ni ZO)",3.66,"(ni ZO)",2.759999999999998]
["SE21-2014apr","3.2 Sončne elektrarne - ostale 2014 april",null,"mikro - manjše od 50kW","SE21",null,null,null,null,null,null,null,null,null,null,null,null,null,null,null,null,null,102.02,0,102.02,{"$f":"+W194","v":102.02},{"$f":"+X194","v":0},{"$f":"+Z194+AA194","v":102.02},102.02,0,102.02,0.88,null,null,null,null,null,null,null,null,null,null,null,null,null,null,{"$f":"W194+X194","v":102.02},{"$f":"ROUND((W194+X194)-AF194*$G$326,2)","v":63.91},{"$f":"+Z194+AA194","v":102.02},{"$f":"ROUND((Z194+AA194)-AF194*$F$326,2)","v":67.13},102.02,69.56,null,"(ni podpore 2011/2)","(ni podpore 2011/2)","(ni podpore 2011/2)","(ni podpore 2011/2)","(ni podpore 2013)","(ni podpore 2013)",0,3.2199999999999989,{"$f":"AY194-AW194","v":0},{"$f":"AZ194-AX194","v":2.4300000000000068}]
["SE22-2014apr","3.2 Sončne elektrarne - ostale 2014 april",null,"mala - manjše od 1MW","SE22",null,null,null,null,null,null,null,null,null,null,null,null,null,null,null,null,null,93.98,0,93.98,93.98,0,93.98,{"$f":"+Z195","v":93.98},{"$f":"+AA195","v":0},{"$f":"+AC195+AD195","v":93.98},0.88,null,null,null,null,null,null,null,null,null,null,null,null,null,null,{"$f":"W195+X195","v":93.98},55.87,{"$f":"+Z195+AA195","v":93.98},59.09,{"$f":"+AC195+AD195","v":93.98},{"$f":"ROUND((AC195+AD195)-AF195*$E$326,2)","v":61.52},null,"(ni podpore 2011/2)","(ni podpore 2011/2)","(ni podpore 2011/2)","(ni podpore 2011/2)","(ni podpore 2013)","(ni podpore 2013)",{"$f":"AW195-AU195","v":0},{"$f":"AX195-AV195","v":3.220000000000006},0,2.4299999999999997]
["SE23-2014apr","3.2 Sončne elektrarne - ostale 2014 april",null,"srednja - od 1MW do vključno 10MW ","SE23",null,null,null,null,null,null,null,null,null,null,null,null,null,null,null,null,null,75.77,0,75.77,75.77,0,75.77,75.77,0,75.77,0.91,null,null,null,null,null,null,null,null,null,null,null,null,null,null,{"$f":"W196+X196","v":75.77},36.36,{"$f":"+Z196+AA196","v":75.77},39.69,75.77,42.2,null,"(ni podpore 2011/2)","(ni podpore 2011/2)","(ni podpore 2011/2)","(ni podpore 2011/2)","(ni podpore 2013)","(ni podpore 2013)",0,3.3299999999999983,0,2.5100000000000051]
["SE24-2014apr","3.2 Sončne elektrarne - ostale 2014 april",null,"velika - nad 10MW do vključno 125MW","SE24",null,null,null,null,null,null,null,null,null,null,null,null,null,null,null,null,null,70.349999999999994,0,70.349999999999994,70.349999999999994,0,70.349999999999994,70.349999999999994,0,70.349999999999994,1,null,null,null,null,null,null,null,null,null,null,null,null,null,null,"(ni ZO)",27.04,"(ni ZO)",30.7,"(ni ZO)",33.46,null,"(ni podpore 2011/2)","(ni podpore 2011/2)","(ni podpore 2011/2)","(ni podpore 2011/2)","(ni podpore 2013)","(ni podpore 2013)","(ni ZO)",3.66,"(ni ZO)",2.7600000000000016]
["SE11-2014maj","3.1 Sončne elektrarne - na stavbah 2014 maj",null,"mikro - manjše od 50kW","SE11",null,null,null,null,null,null,null,null,null,null,null,null,null,null,null,null,null,106.41,0,106.41,106.41,0,106.41,106.41,0,106.41,0.88,null,null,null,null,null,null,null,null,null,null,null,null,null,null,{"$f":"W198+X198","v":106.41},68.3,{"$f":"+Z198+AA198","v":106.41},71.52,106.41,73.95,null,"(ni podpore 2011/2)","(ni podpore 2011/2)","(ni podpore 2011/2)","(ni podpore 2011/2)","(ni podpore 2013)","(ni podpore 2013)",0,3.2199999999999989,0,2.4300000000000068]
["SE12-2014maj","3.1 Sončne elektrarne - na stavbah 2014 maj",null,"mala - manjše od 1MW","SE12",null,null,null,null,null,null,null,null,null,null,null,null,null,null,null,null,null,{"$f":"ROUND(0.98*W191,2)","v":97.31},0,97.31,97.31,0,97.31,97.31,0,97.31,0.88,null,null,null,null,null,null,null,null,null,null,null,null,null,null,{"$f":"W199+X199","v":97.31},59.2,{"$f":"+Z199+AA199","v":97.31},62.42,97.31,64.849999999999994,null,"(ni podpore 2011/2)","(ni podpore 2011/2)","(ni podpore 2011/2)","(ni podpore 2011/2)","(ni podpore 2013)","(ni podpore 2013)",0,3.2199999999999989,0,2.4299999999999926]
["SE13-2014maj","3.1 Sončne elektrarne - na stavbah 2014 maj",null,"srednja - od 1MW do vključno 10MW ","SE13",null,null,null,null,null,null,null,null,null,null,null,null,null,null,null,null,null,80.739999999999995,0,80.739999999999995,80.739999999999995,0,80.739999999999995,80.739999999999995,0,80.739999999999995,0.91,null,null,null,null,null,null,null,null,null,null,null,null,null,null,{"$f":"W200+X200","v":80.739999999999995},41.33,{"$f":"+Z200+AA200","v":80.739999999999995},44.66,80.739999999999995,47.17,null,"(ni podpore 2011/2)","(ni podpore 2011/2)","(ni podpore 2011/2)","(ni podpore 2011/2)","(ni podpore 2013)","(ni podpore 2013)",0,3.3299999999999983,0,2.5100000000000051]
["SE14-2014maj","3.1 Sončne elektrarne - na stavbah 2014 maj",null,"velika - nad 10MW do vključno 125MW","SE14",null,null,null,null,null,null,null,null,null,null,null,null,null,null,null,null,null,71.86,0,71.86,71.86,0,71.86,71.86,0,71.86,1,null,null,null,null,null,null,null,null,null,null,null,null,null,null,"(ni ZO)",28.55,"(ni ZO)",32.21,"(ni ZO)",34.97,null,"(ni podpore 2011/2)","(ni podpore 2011/2)","(ni podpore 2011/2)","(ni podpore 2011/2)","(ni podpore 2013)","(ni podpore 2013)","(ni ZO)",3.66,"(ni ZO)",2.759999999999998]
["SE21-2014maj","3.2 Sončne elektrarne - ostale 2014 maj",null,"mikro - manjše od 50kW","SE21",null,null,null,null,null,null,null,null,null,null,null,null,null,null,null,null,null,99.98,0,99.98,99.98,0,99.98,99.98,0,99.98,0.88,null,null,null,null,null,null,null,null,null,null,null,null,null,null,{"$f":"W202+X202","v":99.98},61.87,{"$f":"+Z202+AA202","v":99.98},65.09,99.98,67.52,null,"(ni podpore 2011/2)","(ni podpore 2011/2)","(ni podpore 2011/2)","(ni podpore 2011/2)","(ni podpore 2013)","(ni podpore 2013)",0,3.220000000000006,0,2.4299999999999926]
["SE22-2014maj","3.2 Sončne elektrarne - ostale 2014 maj",null,"mala - manjše od 1MW","SE22",null,null,null,null,null,null,null,null,null,null,null,null,null,null,null,null,null,92.1,0,92.1,92.1,0,92.1,92.1,0,92.1,0.88,null,null,null,null,null,null,null,null,null,null,null,null,null,null,{"$f":"W203+X203","v":92.1},53.99,{"$f":"+Z203+AA203","v":92.1},57.21,92.1,59.64,null,"(ni podpore 2011/2)","(ni podpore 2011/2)","(ni podpore 2011/2)","(ni podpore 2011/2)","(ni podpore 2013)","(ni podpore 2013)",0,3.2199999999999989,0,2.4299999999999997]
["SE23-2014maj","3.2 Sončne elektrarne - ostale 2014 maj",null,"srednja - od 1MW do vključno 10MW ","SE23",null,null,null,null,null,null,null,null,null,null,null,null,null,null,null,null,null,74.25,0,74.25,74.25,0,74.25,74.25,0,74.25,0.91,null,null,null,null,null,null,null,null,null,null,null,null,null,null,{"$f":"W204+X204","v":74.25},34.840000000000003,{"$f":"+Z204+AA204","v":74.25},38.17,74.25,40.68,null,"(ni podpore 2011/2)","(ni podpore 2011/2)","(ni podpore 2011/2)","(ni podpore 2011/2)","(ni podpore 2013)","(ni podpore 2013)",0,3.3299999999999983,0,2.509999999999998]
["SE24-2014maj","3.2 Sončne elektrarne - ostale 2014 maj",null,"velika - nad 10MW do vključno 125MW","SE24",null,null,null,null,null,null,null,null,null,null,null,null,null,null,null,null,null,68.94,0,68.94,68.94,0,68.94,68.94,0,68.94,1,null,null,null,null,null,null,null,null,null,null,null,null,null,null,"(ni ZO)",25.63,"(ni ZO)",29.29,"(ni ZO)",32.049999999999997,null,"(ni podpore 2011/2)","(ni podpore 2011/2)","(ni podpore 2011/2)","(ni podpore 2011/2)","(ni podpore 2013)","(ni podpore 2013)","(ni ZO)",3.66,"(ni ZO)",2.759999999999998]
["SE11-2014jun","3.1 Sončne elektrarne - na stavbah 2014 junij",null,"mikro - manjše od 50kW","SE11",null,null,null,null,null,null,null,null,null,null,null,null,null,null,null,null,null,104.28,0,104.28,104.28,0,104.28,104.28,0,104.28,0.88,null,null,null,null,null,null,null,null,null,null,null,null,null,null,{"$f":"W206+X206","v":104.28},66.17,{"$f":"+Z206+AA206","v":104.28},69.39,104.28,71.819999999999993,null,"(ni podpore 2011/2)","(ni podpore 2011/2)","(ni podpore 2011/2)","(ni podpore 2011/2)","(ni podpore 2013)","(ni podpore 2013)",0,3.2199999999999989,0,2.4299999999999926]
["SE12-2014jun","3.1 Sončne elektrarne - na stavbah 2014 junij",null,"mala - manjše od 1MW","SE12",null,null,null,null,null,null,null,null,null,null,null,null,null,null,null,null,null,95.36,0,95.36,95.36,0,95.36,95.36,0,95.36,0.88,null,null,null,null,null,null,null,null,null,null,null,null,null,null,{"$f":"W207+X207","v":95.36},57.25,{"$f":"+Z207+AA207","v":95.36},60.47,95.36,62.9,null,"(ni podpore 2011/2)","(ni podpore 2011/2)","(ni podpore 2011/2)","(ni podpore 2011/2)","(ni podpore 2013)","(ni podpore 2013)",0,3.2199999999999989,0,2.4299999999999997]
["SE13-2014jun","3.1 Sončne elektrarne - na stavbah 2014 junij",null,"srednja - od 1MW do vključno 10MW ","SE13",null,null,null,null,null,null,null,null,null,null,null,null,null,null,null,null,null,79.13,0,79.13,79.13,0,79.13,79.13,0,79.13,0.91,null,null,null,null,null,null,null,null,null,null,null,null,null,null,{"$f":"W208+X208","v":79.13},39.72,{"$f":"+Z208+AA208","v":79.13},43.05,79.13,45.56,null,"(ni podpore 2011/2)","(ni podpore 2011/2)","(ni podpore 2011/2)","(ni podpore 2011/2)","(ni podpore 2013)","(ni podpore 2013)",0,3.3299999999999983,0,2.5100000000000051]
["SE14-2014jun","3.1 Sončne elektrarne - na stavbah 2014 junij",null,"velika - nad 10MW do vključno 125MW","SE14",null,null,null,null,null,null,null,null,null,null,null,null,null,null,null,null,null,70.42,0,70.42,70.42,0,70.42,70.42,0,70.42,1,null,null,null,null,null,null,null,null,null,null,null,null,null,null,"(ni ZO)",27.11,"(ni ZO)",30.77,"(ni ZO)",33.53,null,"(ni podpore 2011/2)","(ni podpore 2011/2)","(ni podpore 2011/2)","(ni podpore 2011/2)","(ni podpore 2013)","(ni podpore 2013)","(ni ZO)",3.66,"(ni ZO)",2.7600000000000016]
["SE21-2014jun","3.2 Sončne elektrarne - ostale 2014 junij",null,"mikro - manjše od 50kW","SE21",null,null,null,null,null,null,null,null,null,null,null,null,null,null,null,null,null,97.98,0,97.98,97.98,0,97.98,97.98,0,97.98,0.88,null,null,null,null,null,null,null,null,null,null,null,null,null,null,{"$f":"W210+X210","v":97.98},59.87,{"$f":"+Z210+AA210","v":97.98},63.09,97.98,65.52,null,"(ni podpore 2011/2)","(ni podpore 2011/2)","(ni podpore 2011/2)","(ni podpore 2011/2)","(ni podpore 2013)","(ni podpore 2013)",0,3.220000000000006,0,2.4299999999999926]
["SE22-2014jun","3.2 Sončne elektrarne - ostale 2014 junij",null,"mala - manjše od 1MW","SE22",null,null,null,null,null,null,null,null,null,null,null,null,null,null,null,null,null,90.26,0,90.26,90.26,0,90.26,90.26,0,90.26,0.88,null,null,null,null,null,null,null,null,null,null,null,null,null,null,{"$f":"W211+X211","v":90.26},52.15,{"$f":"+Z211+AA211","v":90.26},55.37,90.26,57.8,null,"(ni podpore 2011/2)","(ni podpore 2011/2)","(ni podpore 2011/2)","(ni podpore 2011/2)","(ni podpore 2013)","(ni podpore 2013)",0,3.2199999999999989,0,2.4299999999999997]
["SE23-2014jun","3.2 Sončne elektrarne - ostale 2014 junij",null,"srednja - od 1MW do vključno 10MW ","SE23",null,null,null,null,null,null,null,null,null,null,null,null,null,null,null,null,null,72.77,0,72.77,72.77,0,72.77,72.77,0,72.77,0.91,null,null,null,null,null,null,null,null,null,null,null,null,null,null,{"$f":"W212+X212","v":72.77},33.36,{"$f":"+Z212+AA212","v":72.77},36.69,72.77,39.200000000000003,null,"(ni podpore 2011/2)","(ni podpore 2011/2)","(ni podpore 2011/2)","(ni podpore 2011/2)","(ni podpore 2013)","(ni podpore 2013)",0,3.3299999999999983,0,2.5100000000000051]
["SE24-2014jun","3.2 Sončne elektrarne - ostale 2014 junij",null,"velika - nad 10MW do vključno 125MW","SE24",null,null,null,null,null,null,null,null,null,null,null,null,null,null,null,null,null,67.56,0,67.56,67.56,0,67.56,67.56,0,67.56,1,null,null,null,null,null,null,null,null,null,null,null,null,null,null,"(ni ZO)",24.25,"(ni ZO)",27.91,"(ni ZO)",30.67,null,"(ni podpore 2011/2)","(ni podpore 2011/2)","(ni podpore 2011/2)","(ni podpore 2011/2)","(ni podpore 2013)","(ni podpore 2013)","(ni ZO)",3.66,"(ni ZO)",2.7600000000000016]
["SE11-2014jul","3.1 Sončne elektrarne - na stavbah 2014 julij",null,"mikro - manjše od 50kW","SE11",null,null,null,null,null,null,null,null,null,null,null,null,null,null,null,null,null,102.19,0,102.19,102.19,0,102.19,102.19,0,102.19,0.88,null,null,null,null,null,null,null,null,null,null,null,null,null,null,{"$f":"W214+X214","v":102.19},64.08,{"$f":"+Z214+AA214","v":102.19},67.3,102.19,69.73,null,"(ni podpore 2011/2)","(ni podpore 2011/2)","(ni podpore 2011/2)","(ni podpore 2011/2)","(ni podpore 2013)","(ni podpore 2013)",0,3.2199999999999989,0,2.4300000000000068]
["SE12-2014jul","3.1 Sončne elektrarne - na stavbah 2014 julij",null,"mala - manjše od 1MW","SE12",null,null,null,null,null,null,null,null,null,null,null,null,null,null,null,null,null,93.45,0,93.45,93.45,0,93.45,93.45,0,93.45,0.88,null,null,null,null,null,null,null,null,null,null,null,null,null,null,{"$f":"W215+X215","v":93.45},55.34,{"$f":"+Z215+AA215","v":93.45},58.56,93.45,60.99,null,"(ni podpore 2011/2)","(ni podpore 2011/2)","(ni podpore 2011/2)","(ni podpore 2011/2)","(ni podpore 2013)","(ni podpore 2013)",0,3.2199999999999989,0,2.4299999999999997]
["SE13-2014jul","3.1 Sončne elektrarne - na stavbah 2014 julij",null,"srednja - od 1MW do vključno 10MW ","SE13",null,null,null,null,null,null,null,null,null,null,null,null,null,null,null,null,null,77.55,0,77.55,77.55,0,77.55,77.55,0,77.55,0.91,null,null,null,null,null,null,null,null,null,null,null,null,null,null,{"$f":"W216+X216","v":77.55},38.14,{"$f":"+Z216+AA216","v":77.55},41.47,77.55,43.98,null,"(ni podpore 2011/2)","(ni podpore 2011/2)","(ni podpore 2011/2)","(ni podpore 2011/2)","(ni podpore 2013)","(ni podpore 2013)",0,3.3299999999999983,0,2.509999999999998]
["SE14-2014jul","3.1 Sončne elektrarne - na stavbah 2014 julij",null,"velika - nad 10MW do vključno 125MW","SE14",null,null,null,null,null,null,null,null,null,null,null,null,null,null,null,null,null,69.010000000000005,0,69.010000000000005,69.010000000000005,0,69.010000000000005,69.010000000000005,0,69.010000000000005,1,null,null,null,null,null,null,null,null,null,null,null,null,null,null,"(ni ZO)",25.7,"(ni ZO)",29.36,"(ni ZO)",32.119999999999997,null,"(ni podpore 2011/2)","(ni podpore 2011/2)","(ni podpore 2011/2)","(ni podpore 2011/2)","(ni podpore 2013)","(ni podpore 2013)","(ni ZO)",3.66,"(ni ZO)",2.759999999999998]
["SE21-2014jul","3.2 Sončne elektrarne - ostale 2014 julij",null,"mikro - manjše od 50kW","SE21",null,null,null,null,null,null,null,null,null,null,null,null,null,null,null,null,null,96.02,0,96.02,96.02,0,96.02,96.02,0,96.02,0.88,null,null,null,null,null,null,null,null,null,null,null,null,null,null,{"$f":"W218+X218","v":96.02},57.91,{"$f":"+Z218+AA218","v":96.02},61.13,96.02,63.56,null,"(ni podpore 2011/2)","(ni podpore 2011/2)","(ni podpore 2011/2)","(ni podpore 2011/2)","(ni podpore 2013)","(ni podpore 2013)",0,3.220000000000006,0,2.4299999999999997]
["SE22-2014jul","3.2 Sončne elektrarne - ostale 2014 julij",null,"mala - manjše od 1MW","SE22",null,null,null,null,null,null,null,null,null,null,null,null,null,null,null,null,null,88.45,0,88.45,88.45,0,88.45,88.45,0,88.45,0.88,null,null,null,null,null,null,null,null,null,null,null,null,null,null,{"$f":"W219+X219","v":88.45},50.34,{"$f":"+Z219+AA219","v":88.45},53.56,88.45,55.99,null,"(ni podpore 2011/2)","(ni podpore 2011/2)","(ni podpore 2011/2)","(ni podpore 2011/2)","(ni podpore 2013)","(ni podpore 2013)",0,3.2199999999999989,0,2.4299999999999997]
["SE23-2014jul","3.2 Sončne elektrarne - ostale 2014 julij",null,"srednja - od 1MW do vključno 10MW ","SE23",null,null,null,null,null,null,null,null,null,null,null,null,null,null,null,null,null,71.31,0,71.31,71.31,0,71.31,71.31,0,71.31,0.91,null,null,null,null,null,null,null,null,null,null,null,null,null,null,{"$f":"W220+X220","v":71.31},31.9,{"$f":"+Z220+AA220","v":71.31},35.229999999999997,71.31,37.74,null,"(ni podpore 2011/2)","(ni podpore 2011/2)","(ni podpore 2011/2)","(ni podpore 2011/2)","(ni podpore 2013)","(ni podpore 2013)",0,3.3299999999999983,0,2.5100000000000051]
["SE24-2014jul","3.2 Sončne elektrarne - ostale 2014 julij",null,"velika - nad 10MW do vključno 125MW","SE24",null,null,null,null,null,null,null,null,null,null,null,null,null,null,null,null,null,66.209999999999994,0,66.209999999999994,66.209999999999994,0,66.209999999999994,66.209999999999994,0,66.209999999999994,1,null,null,null,null,null,null,null,null,null,null,null,null,null,null,"(ni ZO)",22.9,"(ni ZO)",26.56,"(ni ZO)",29.32,null,"(ni podpore 2011/2)","(ni podpore 2011/2)","(ni podpore 2011/2)","(ni podpore 2011/2)","(ni podpore 2013)","(ni podpore 2013)","(ni ZO)",3.66,"(ni ZO)",2.7600000000000016]
["SE11-2014avg","3.1 Sončne elektrarne - na stavbah 2014 avgust",null,"mikro - manjše od 50kW","SE11",null,null,null,null,null,null,null,null,null,null,null,null,null,null,null,null,null,100.15,0,100.15,100.15,0,100.15,100.15,0,100.15,0.88,null,null,null,null,null,null,null,null,null,null,null,null,null,null,{"$f":"W222+X222","v":100.15},62.04,{"$f":"+Z222+AA222","v":100.15},65.260000000000005,100.15,67.69,null,"(ni podpore 2011/2)","(ni podpore 2011/2)","(ni podpore 2011/2)","(ni podpore 2011/2)","(ni podpore 2013)","(ni podpore 2013)",0,3.220000000000006,0,2.4299999999999926]
["SE12-2014avg","3.1 Sončne elektrarne - na stavbah 2014 avgust",null,"mala - manjše od 1MW","SE12",null,null,null,null,null,null,null,null,null,null,null,null,null,null,null,null,null,91.58,0,91.58,91.58,0,91.58,91.58,0,91.58,0.88,null,null,null,null,null,null,null,null,null,null,null,null,null,null,{"$f":"W223+X223","v":91.58},53.47,{"$f":"+Z223+AA223","v":91.58},56.69,91.58,59.12,null,"(ni podpore 2011/2)","(ni podpore 2011/2)","(ni podpore 2011/2)","(ni podpore 2011/2)","(ni podpore 2013)","(ni podpore 2013)",0,3.2199999999999989,0,2.4299999999999997]
["SE13-2014avg","3.1 Sončne elektrarne - na stavbah 2014 avgust",null,"srednja - od 1MW do vključno 10MW ","SE13",null,null,null,null,null,null,null,null,null,null,null,null,null,null,null,null,null,76,0,76,76,0,76,76,0,76,0.91,null,null,null,null,null,null,null,null,null,null,null,null,null,null,{"$f":"W224+X224","v":76},36.590000000000003,{"$f":"+Z224+AA224","v":76},39.92,76,42.43,null,"(ni podpore 2011/2)","(ni podpore 2011/2)","(ni podpore 2011/2)","(ni podpore 2011/2)","(ni podpore 2013)","(ni podpore 2013)",0,3.3299999999999983,0,2.509999999999998]
["SE14-2014avg","3.1 Sončne elektrarne - na stavbah 2014 avgust",null,"velika - nad 10MW do vključno 125MW","SE14",null,null,null,null,null,null,null,null,null,null,null,null,null,null,null,null,null,67.63,0,67.63,67.63,0,67.63,67.63,0,67.63,1,null,null,null,null,null,null,null,null,null,null,null,null,null,null,"(ni ZO)",24.32,"(ni ZO)",27.98,"(ni ZO)",30.74,null,"(ni podpore 2011/2)","(ni podpore 2011/2)","(ni podpore 2011/2)","(ni podpore 2011/2)","(ni podpore 2013)","(ni podpore 2013)","(ni ZO)",3.66,"(ni ZO)",2.759999999999998]
["SE21-2014avg","3.2 Sončne elektrarne - ostale 2014 avgust",null,"mikro - manjše od 50kW","SE21",null,null,null,null,null,null,null,null,null,null,null,null,null,null,null,null,null,94.1,0,94.1,94.1,0,94.1,94.1,0,94.1,0.88,null,null,null,null,null,null,null,null,null,null,null,null,null,null,{"$f":"W226+X226","v":94.1},55.99,{"$f":"+Z226+AA226","v":94.1},59.21,94.1,61.64,null,"(ni podpore 2011/2)","(ni podpore 2011/2)","(ni podpore 2011/2)","(ni podpore 2011/2)","(ni podpore 2013)","(ni podpore 2013)",0,3.2199999999999989,0,2.4299999999999997]
["SE22-2014avg","3.2 Sončne elektrarne - ostale 2014 avgust",null,"mala - manjše od 1MW","SE22",null,null,null,null,null,null,null,null,null,null,null,null,null,null,null,null,null,86.68,0,86.68,86.68,0,86.68,86.68,0,86.68,0.88,null,null,null,null,null,null,null,null,null,null,null,null,null,null,{"$f":"W227+X227","v":86.68},48.57,{"$f":"+Z227+AA227","v":86.68},51.79,86.68,54.22,null,"(ni podpore 2011/2)","(ni podpore 2011/2)","(ni podpore 2011/2)","(ni podpore 2011/2)","(ni podpore 2013)","(ni podpore 2013)",0,3.2199999999999989,0,2.4299999999999997]
["SE23-2014avg","3.2 Sončne elektrarne - ostale 2014 avgust",null,"srednja - od 1MW do vključno 10MW ","SE23",null,null,null,null,null,null,null,null,null,null,null,null,null,null,null,null,null,69.88,0,69.88,69.88,0,69.88,69.88,0,69.88,0.91,null,null,null,null,null,null,null,null,null,null,null,null,null,null,{"$f":"W228+X228","v":69.88},30.47,{"$f":"+Z228+AA228","v":69.88},33.799999999999997,69.88,36.31,null,"(ni podpore 2011/2)","(ni podpore 2011/2)","(ni podpore 2011/2)","(ni podpore 2011/2)","(ni podpore 2013)","(ni podpore 2013)",0,3.3299999999999983,0,2.5100000000000051]
["SE24-2014avg","3.2 Sončne elektrarne - ostale 2014 avgust",null,"velika - nad 10MW do vključno 125MW","SE24",null,null,null,null,null,null,null,null,null,null,null,null,null,null,null,null,null,64.89,0,64.89,64.89,0,64.89,64.89,0,64.89,1,null,null,null,null,null,null,null,null,null,null,null,null,null,null,"(ni ZO)",21.58,"(ni ZO)",25.24,"(ni ZO)",28,null,"(ni podpore 2011/2)","(ni podpore 2011/2)","(ni podpore 2011/2)","(ni podpore 2011/2)","(ni podpore 2013)","(ni podpore 2013)","(ni ZO)",3.66,"(ni ZO)",2.7600000000000016]
["SE11-2014sep","3.1 Sončne elektrarne - na stavbah 2014 september",null,"mikro - manjše od 50kW","SE11",null,null,null,null,null,null,null,null,null,null,null,null,null,null,null,null,null,98.15,0,{"$f":"W230+X230","v":98.15},98.15,0,98.15,98.15,0,98.15,0.88,null,null,null,null,null,null,null,null,null,null,null,null,null,null,{"$f":"W230+X230","v":98.15},60.04,{"$f":"+Z230+AA230","v":98.15},63.26,98.15,65.69,null,"(ni podpore 2011/2)","(ni podpore 2011/2)","(ni podpore 2011/2)","(ni podpore 2011/2)","(ni podpore 2013)","(ni podpore 2013)",0,3.2199999999999989,0,2.4299999999999997]
["SE12-2014sep","3.1 Sončne elektrarne - na stavbah 2014 september",null,"mala - manjše od 1MW","SE12",null,null,null,null,null,null,null,null,null,null,null,null,null,null,null,null,null,89.75,0,89.75,89.75,0,89.75,89.75,0,89.75,0.88,null,null,null,null,null,null,null,null,null,null,null,null,null,null,{"$f":"W231+X231","v":89.75},51.64,{"$f":"+Z231+AA231","v":89.75},54.86,89.75,57.29,null,"(ni podpore 2011/2)","(ni podpore 2011/2)","(ni podpore 2011/2)","(ni podpore 2011/2)","(ni podpore 2013)","(ni podpore 2013)",0,3.2199999999999989,0,2.4299999999999997]
["SE13-2014sep","3.1 Sončne elektrarne - na stavbah 2014 september",null,"srednja - od 1MW do vključno 10MW ","SE13",null,null,null,null,null,null,null,null,null,null,null,null,null,null,null,null,null,74.48,0,74.48,74.48,0,74.48,74.48,0,74.48,0.91,null,null,null,null,null,null,null,null,null,null,null,null,null,null,{"$f":"W232+X232","v":74.48},35.07,{"$f":"+Z232+AA232","v":74.48},38.4,74.48,40.909999999999997,null,"(ni podpore 2011/2)","(ni podpore 2011/2)","(ni podpore 2011/2)","(ni podpore 2011/2)","(ni podpore 2013)","(ni podpore 2013)",0,3.3299999999999983,0,2.509999999999998]
["SE14-2014sep","3.1 Sončne elektrarne - na stavbah 2014 september",null,"velika - nad 10MW do vključno 125MW","SE14",null,null,null,null,null,null,null,null,null,null,null,null,null,null,null,null,null,66.28,0,66.28,66.28,0,66.28,66.28,0,66.28,1,null,null,null,null,null,null,null,null,null,null,null,null,null,null,"(ni ZO)",22.97,"(ni ZO)",26.63,"(ni ZO)",29.39,null,"(ni podpore 2011/2)","(ni podpore 2011/2)","(ni podpore 2011/2)","(ni podpore 2011/2)","(ni podpore 2013)","(ni podpore 2013)","(ni ZO)",3.66,"(ni ZO)",2.7600000000000016]
["SE21-2014sep","3.2 Sončne elektrarne - ostale 2014 september",null,"mikro - manjše od 50kW","SE21",null,null,null,null,null,null,null,null,null,null,null,null,null,null,null,null,null,92.22,0,92.22,92.22,0,92.22,92.22,0,92.22,0.88,null,null,null,null,null,null,null,null,null,null,null,null,null,null,{"$f":"W234+X234","v":92.22},54.11,{"$f":"+Z234+AA234","v":92.22},57.33,92.22,59.76,null,"(ni podpore 2011/2)","(ni podpore 2011/2)","(ni podpore 2011/2)","(ni podpore 2011/2)","(ni podpore 2013)","(ni podpore 2013)",0,3.2199999999999989,0,2.4299999999999997]
["SE22-2014sep","3.2 Sončne elektrarne - ostale 2014 september",null,"mala - manjše od 1MW","SE22",null,null,null,null,null,null,null,null,null,null,null,null,null,null,null,null,null,84.95,0,84.95,84.95,0,84.95,84.95,0,84.95,0.88,null,null,null,null,null,null,null,null,null,null,null,null,null,null,{"$f":"W235+X235","v":84.95},46.84,{"$f":"+Z235+AA235","v":84.95},50.06,84.95,52.49,null,"(ni podpore 2011/2)","(ni podpore 2011/2)","(ni podpore 2011/2)","(ni podpore 2011/2)","(ni podpore 2013)","(ni podpore 2013)",0,3.2199999999999989,0,2.4299999999999997]
["SE23-2014sep","3.2 Sončne elektrarne - ostale 2014 september",null,"srednja - od 1MW do vključno 10MW ","SE23",null,null,null,null,null,null,null,null,null,null,null,null,null,null,null,null,null,68.48,0,68.48,68.48,0,68.48,68.48,0,68.48,0.91,null,null,null,null,null,null,null,null,null,null,null,null,null,null,{"$f":"W236+X236","v":68.48},29.07,{"$f":"+Z236+AA236","v":68.48},32.4,68.48,34.909999999999997,null,"(ni podpore 2011/2)","(ni podpore 2011/2)","(ni podpore 2011/2)","(ni podpore 2011/2)","(ni podpore 2013)","(ni podpore 2013)",0,3.3299999999999983,0,2.509999999999998]
["SE24-2014sep","3.2 Sončne elektrarne - ostale 2014 september",null,"velika - nad 10MW do vključno 125MW","SE24",null,null,null,null,null,null,null,null,null,null,null,null,null,null,null,null,null,63.59,0,63.59,63.59,0,63.59,63.59,0,63.59,1,null,null,null,null,null,null,null,null,null,null,null,null,null,null,"(ni ZO)",20.28,"(ni ZO)",23.94,"(ni ZO)",26.7,null,"(ni podpore 2011/2)","(ni podpore 2011/2)","(ni podpore 2011/2)","(ni podpore 2011/2)","(ni podpore 2013)","(ni podpore 2013)","(ni ZO)",3.66,"(ni ZO)",2.759999999999998]
["SE11-2014okt","3.1 Sončne elektrarne - na stavbah 2014 oktober",null,"mikro - manjše od 50kW","SE11",null,null,null,null,null,null,null,null,null,null,null,null,null,null,null,null,null,96.19,0,96.19,96.19,0,96.19,96.19,0,96.19,0.88,null,null,null,null,null,null,null,null,null,null,null,null,null,null,{"$f":"W238+X238","v":96.19},58.08,{"$f":"+Z238+AA238","v":96.19},61.3,96.19,63.73,null,"(ni podpore 2011/2)","(ni podpore 2011/2)","(ni podpore 2011/2)","(ni podpore 2011/2)","(ni podpore 2013)","(ni podpore 2013)",0,3.2199999999999989,0,2.4299999999999997]
["SE12-2014okt","3.1 Sončne elektrarne - na stavbah 2014 oktober",null,"mala - manjše od 1MW","SE12",null,null,null,null,null,null,null,null,null,null,null,null,null,null,null,null,null,87.96,0,87.96,87.96,0,87.96,87.96,0,87.96,0.88,null,null,null,null,null,null,null,null,null,null,null,null,null,null,{"$f":"W239+X239","v":87.96},49.85,{"$f":"+Z239+AA239","v":87.96},53.07,87.96,55.5,null,"(ni podpore 2011/2)","(ni podpore 2011/2)","(ni podpore 2011/2)","(ni podpore 2011/2)","(ni podpore 2013)","(ni podpore 2013)",0,3.2199999999999989,0,2.4299999999999997]
["SE13-2014okt","3.1 Sončne elektrarne - na stavbah 2014 oktober",null,"srednja - od 1MW do vključno 10MW ","SE13",null,null,null,null,null,null,null,null,null,null,null,null,null,null,null,null,null,72.989999999999995,0,72.989999999999995,72.989999999999995,0,72.989999999999995,72.989999999999995,0,72.989999999999995,0.91,null,null,null,null,null,null,null,null,null,null,null,null,null,null,{"$f":"W240+X240","v":72.989999999999995},33.58,{"$f":"+Z240+AA240","v":72.989999999999995},36.909999999999997,72.989999999999995,39.42,null,"(ni podpore 2011/2)","(ni podpore 2011/2)","(ni podpore 2011/2)","(ni podpore 2011/2)","(ni podpore 2013)","(ni podpore 2013)",0,3.3299999999999983,0,2.5100000000000051]
["SE14-2014okt","3.1 Sončne elektrarne - na stavbah 2014 oktober",null,"velika - nad 10MW do vključno 125MW","SE14",null,null,null,null,null,null,null,null,null,null,null,null,null,null,null,null,null,64.95,0,64.95,64.95,0,64.95,64.95,0,64.95,1,null,null,null,null,null,null,null,null,null,null,null,null,null,null,"(ni ZO)",21.64,"(ni ZO)",25.3,"(ni ZO)",28.06,null,"(ni podpore 2011/2)","(ni podpore 2011/2)","(ni podpore 2011/2)","(ni podpore 2011/2)","(ni podpore 2013)","(ni podpore 2013)","(ni ZO)",3.66,"(ni ZO)",2.759999999999998]
["SE21-2014okt","3.2 Sončne elektrarne - ostale 2014 oktober",null,"mikro - manjše od 50kW","SE21",null,null,null,null,null,null,null,null,null,null,null,null,null,null,null,null,null,90.38,0,90.38,90.38,0,90.38,90.38,0,90.38,0.88,null,null,null,null,null,null,null,null,null,null,null,null,null,null,{"$f":"W242+X242","v":90.38},52.27,{"$f":"+Z242+AA242","v":90.38},55.49,90.38,57.92,null,"(ni podpore 2011/2)","(ni podpore 2011/2)","(ni podpore 2011/2)","(ni podpore 2011/2)","(ni podpore 2013)","(ni podpore 2013)",0,3.2199999999999989,0,2.4299999999999997]
["SE22-2014okt","3.2 Sončne elektrarne - ostale 2014 oktober",null,"mala - manjše od 1MW","SE22",null,null,null,null,null,null,null,null,null,null,null,null,null,null,null,null,null,83.25,0,83.25,83.25,0,83.25,83.25,0,83.25,0.88,null,null,null,null,null,null,null,null,null,null,null,null,null,null,{"$f":"W243+X243","v":83.25},45.14,{"$f":"+Z243+AA243","v":83.25},48.36,83.25,50.79,null,"(ni podpore 2011/2)","(ni podpore 2011/2)","(ni podpore 2011/2)","(ni podpore 2011/2)","(ni podpore 2013)","(ni podpore 2013)",0,3.2199999999999989,0,2.4299999999999997]
["SE23-2014okt","3.2 Sončne elektrarne - ostale 2014 oktober",null,"srednja - od 1MW do vključno 10MW ","SE23",null,null,null,null,null,null,null,null,null,null,null,null,null,null,null,null,null,67.11,0,67.11,67.11,0,67.11,67.11,0,67.11,0.91,null,null,null,null,null,null,null,null,null,null,null,null,null,null,{"$f":"W244+X244","v":67.11},27.7,{"$f":"+Z244+AA244","v":67.11},31.03,67.11,33.54,null,"(ni podpore 2011/2)","(ni podpore 2011/2)","(ni podpore 2011/2)","(ni podpore 2011/2)","(ni podpore 2013)","(ni podpore 2013)",0,3.3300000000000018,0,2.509999999999998]
["SE24-2014okt","3.2 Sončne elektrarne - ostale 2014 oktober",null,"velika - nad 10MW do vključno 125MW","SE24",null,null,null,null,null,null,null,null,null,null,null,null,null,null,null,null,null,62.32,0,62.32,62.32,0,62.32,62.32,0,62.32,1,null,null,null,null,null,null,null,null,null,null,null,null,null,null,"(ni ZO)",19.010000000000002,"(ni ZO)",22.67,"(ni ZO)",25.43,null,"(ni podpore 2011/2)","(ni podpore 2011/2)","(ni podpore 2011/2)","(ni podpore 2011/2)","(ni podpore 2013)","(ni podpore 2013)","(ni ZO)",3.66,"(ni ZO)",2.759999999999998]
["SE11-2014nov","3.1 Sončne elektrarne - na stavbah 2014 november",null,"mikro - manjše od 50kW","SE11",null,null,null,null,null,null,null,null,null,null,null,null,null,null,null,null,null,94.27,0,94.27,94.27,0,94.27,94.27,0,94.27,0.88,null,null,null,null,null,null,null,null,null,null,null,null,null,null,{"$f":"W246+X246","v":94.27},56.16,{"$f":"+Z246+AA246","v":94.27},59.38,94.27,61.81,null,"(ni podpore 2011/2)","(ni podpore 2011/2)","(ni podpore 2011/2)","(ni podpore 2011/2)","(ni podpore 2013)","(ni podpore 2013)",0,3.220000000000006,0,2.4299999999999997]
["SE12-2014nov","3.1 Sončne elektrarne - na stavbah 2014 november",null,"mala - manjše od 1MW","SE12",null,null,null,null,null,null,null,null,null,null,null,null,null,null,null,null,null,86.2,0,86.2,86.2,0,86.2,86.2,0,86.2,0.88,null,null,null,null,null,null,null,null,null,null,null,null,null,null,{"$f":"W247+X247","v":86.2},48.09,{"$f":"+Z247+AA247","v":86.2},51.31,86.2,53.74,null,"(ni podpore 2011/2)","(ni podpore 2011/2)","(ni podpore 2011/2)","(ni podpore 2011/2)","(ni podpore 2013)","(ni podpore 2013)",0,3.2199999999999989,0,2.4299999999999997]
["SE13-2014nov","3.1 Sončne elektrarne - na stavbah 2014 november",null,"srednja - od 1MW do vključno 10MW ","SE13",null,null,null,null,null,null,null,null,null,null,null,null,null,null,null,null,null,71.53,0,71.53,71.53,0,71.53,71.53,0,71.53,0.91,null,null,null,null,null,null,null,null,null,null,null,null,null,null,{"$f":"W248+X248","v":71.53},32.119999999999997,{"$f":"+Z248+AA248","v":71.53},35.450000000000003,71.53,37.96,null,"(ni podpore 2011/2)","(ni podpore 2011/2)","(ni podpore 2011/2)","(ni podpore 2011/2)","(ni podpore 2013)","(ni podpore 2013)",0,3.3300000000000054,0,2.509999999999998]
["SE14-2014nov","3.1 Sončne elektrarne - na stavbah 2014 november",null,"velika - nad 10MW do vključno 125MW","SE14",null,null,null,null,null,null,null,null,null,null,null,null,null,null,null,null,null,63.65,0,63.65,63.65,0,63.65,63.65,0,63.65,1,null,null,null,null,null,null,null,null,null,null,null,null,null,null,"(ni ZO)",20.34,"(ni ZO)",24,"(ni ZO)",26.76,null,"(ni podpore 2011/2)","(ni podpore 2011/2)","(ni podpore 2011/2)","(ni podpore 2011/2)","(ni podpore 2013)","(ni podpore 2013)","(ni ZO)",3.66,"(ni ZO)",2.7600000000000016]
["SE21-2014nov","3.2 Sončne elektrarne - ostale 2014 november",null,"mikro - manjše od 50kW","SE21",null,null,null,null,null,null,null,null,null,null,null,null,null,null,null,null,null,88.57,0,88.57,88.57,0,88.57,88.57,0,88.57,0.88,null,null,null,null,null,null,null,null,null,null,null,null,null,null,{"$f":"W250+X250","v":88.57},50.46,{"$f":"+Z250+AA250","v":88.57},53.68,88.57,56.11,null,"(ni podpore 2011/2)","(ni podpore 2011/2)","(ni podpore 2011/2)","(ni podpore 2011/2)","(ni podpore 2013)","(ni podpore 2013)",0,3.2199999999999989,0,2.4299999999999997]
["SE22-2014nov","3.2 Sončne elektrarne - ostale 2014 november",null,"mala - manjše od 1MW","SE22",null,null,null,null,null,null,null,null,null,null,null,null,null,null,null,null,null,81.59,0,81.59,81.59,0,81.59,81.59,0,81.59,0.88,null,null,null,null,null,null,null,null,null,null,null,null,null,null,{"$f":"W251+X251","v":81.59},43.48,{"$f":"+Z251+AA251","v":81.59},46.7,81.59,49.13,null,"(ni podpore 2011/2)","(ni podpore 2011/2)","(ni podpore 2011/2)","(ni podpore 2011/2)","(ni podpore 2013)","(ni podpore 2013)",0,3.220000000000006,0,2.4299999999999997]
["SE23-2014nov","3.2 Sončne elektrarne - ostale 2014 november",null,"srednja - od 1MW do vključno 10MW ","SE23",null,null,null,null,null,null,null,null,null,null,null,null,null,null,null,null,null,65.77,0,65.77,65.77,0,65.77,65.77,0,65.77,0.91,null,null,null,null,null,null,null,null,null,null,null,null,null,null,{"$f":"W252+X252","v":65.77},26.36,{"$f":"+Z252+AA252","v":65.77},29.69,65.77,32.200000000000003,null,"(ni podpore 2011/2)","(ni podpore 2011/2)","(ni podpore 2011/2)","(ni podpore 2011/2)","(ni podpore 2013)","(ni podpore 2013)",0,3.3300000000000018,0,2.5100000000000016]
["SE24-2014nov","3.2 Sončne elektrarne - ostale 2014 november",null,"velika - nad 10MW do vključno 125MW","SE24",null,null,null,null,null,null,null,null,null,null,null,null,null,null,null,null,null,61.07,0,61.07,61.07,0,61.07,61.07,0,61.07,1,null,null,null,null,null,null,null,null,null,null,null,null,null,null,"(ni ZO)",17.760000000000002,"(ni ZO)",21.42,"(ni ZO)",24.18,null,"(ni podpore 2011/2)","(ni podpore 2011/2)","(ni podpore 2011/2)","(ni podpore 2011/2)","(ni podpore 2013)","(ni podpore 2013)","(ni ZO)",3.66,"(ni ZO)",2.759999999999998]
["SE11-2014dec","3.1 Sončne elektrarne - na stavbah 2014 december",null,"mikro - manjše od 50kW","SE11",null,null,null,null,null,null,null,null,null,null,null,null,null,null,null,null,null,92.38,0,92.38,92.38,0,92.38,92.38,0,92.38,0.88,null,null,null,null,null,null,null,null,null,null,null,null,null,null,{"$f":"W254+X254","v":92.38},54.27,{"$f":"+Z254+AA254","v":92.38},57.49,92.38,59.92,null,"(ni podpore 2011/2)","(ni podpore 2011/2)","(ni podpore 2011/2)","(ni podpore 2011/2)","(ni podpore 2013)","(ni podpore 2013)",0,3.2199999999999989,0,2.4299999999999997]
["SE12-2014dec","3.1 Sončne elektrarne - na stavbah 2014 december",null,"mala - manjše od 1MW","SE12",null,null,null,null,null,null,null,null,null,null,null,null,null,null,null,null,null,84.48,0,84.48,84.48,0,84.48,84.48,0,84.48,0.88,null,null,null,null,null,null,null,null,null,null,null,null,null,null,{"$f":"W255+X255","v":84.48},46.37,{"$f":"+Z255+AA255","v":84.48},49.59,84.48,52.02,null,"(ni podpore 2011/2)","(ni podpore 2011/2)","(ni podpore 2011/2)","(ni podpore 2011/2)","(ni podpore 2013)","(ni podpore 2013)",0,3.220000000000006,0,2.4299999999999997]
["SE13-2014dec","3.1 Sončne elektrarne - na stavbah 2014 december",null,"srednja - od 1MW do vključno 10MW ","SE13",null,null,null,null,null,null,null,null,null,null,null,null,null,null,null,null,null,70.099999999999994,0,70.099999999999994,70.099999999999994,0,70.099999999999994,70.099999999999994,0,70.099999999999994,0.91,null,null,null,null,null,null,null,null,null,null,null,null,null,null,{"$f":"W256+X256","v":70.099999999999994},30.69,{"$f":"+Z256+AA256","v":70.099999999999994},34.020000000000003,70.099999999999994,36.53,null,"(ni podpore 2011/2)","(ni podpore 2011/2)","(ni podpore 2011/2)","(ni podpore 2011/2)","(ni podpore 2013)","(ni podpore 2013)",0,3.3300000000000018,0,2.509999999999998]
["SE14-2014dec","3.1 Sončne elektrarne - na stavbah 2014 december",null,"velika - nad 10MW do vključno 125MW","SE14",null,null,null,null,null,null,null,null,null,null,null,null,null,null,null,null,null,62.38,0,62.38,62.38,0,62.38,62.38,0,62.38,1,null,null,null,null,null,null,null,null,null,null,null,null,null,null,"(ni ZO)",19.07,"(ni ZO)",22.73,"(ni ZO)",25.49,null,"(ni podpore 2011/2)","(ni podpore 2011/2)","(ni podpore 2011/2)","(ni podpore 2011/2)","(ni podpore 2013)","(ni podpore 2013)","(ni ZO)",3.66,"(ni ZO)",2.759999999999998]
["SE21-2014dec","3.2 Sončne elektrarne - ostale 2014 december",null,"mikro - manjše od 50kW","SE21",null,null,null,null,null,null,null,null,null,null,null,null,null,null,null,null,null,86.8,0,86.8,{"$f":"+W258","v":86.8},{"$f":"+X258","v":0},{"$f":"+Z258+AA258","v":86.8},86.8,0,86.8,0.88,null,null,null,null,null,null,null,null,null,null,null,null,null,null,{"$f":"W258+X258","v":86.8},{"$f":"ROUND((W258+X258)-AF258*$G$326,2)","v":48.69},{"$f":"+Z258+AA258","v":86.8},{"$f":"ROUND((Z258+AA258)-AF258*$F$326,2)","v":51.91},86.8,54.34,null,"(ni podpore 2011/2)","(ni podpore 2011/2)","(ni podpore 2011/2)","(ni podpore 2011/2)","(ni podpore 2013)","(ni podpore 2013)",0,3.2199999999999989,{"$f":"AY258-AW258","v":0},{"$f":"AZ258-AX258","v":2.4300000000000068}]
["SE22-2014dec","3.2 Sončne elektrarne - ostale 2014 december",null,"mala - manjše od 1MW","SE22",null,null,null,null,null,null,null,null,null,null,null,null,null,null,null,null,null,79.959999999999994,0,79.959999999999994,79.959999999999994,0,79.959999999999994,{"$f":"+Z259","v":79.959999999999994},{"$f":"+AA259","v":0},{"$f":"+AC259+AD259","v":79.959999999999994},0.88,null,null,null,null,null,null,null,null,null,null,null,null,null,null,{"$f":"W259+X259","v":79.959999999999994},41.85,{"$f":"+Z259+AA259","v":79.959999999999994},45.07,{"$f":"+AC259+AD259","v":79.959999999999994},{"$f":"ROUND((AC259+AD259)-AF259*$E$326,2)","v":47.5},null,"(ni podpore 2011/2)","(ni podpore 2011/2)","(ni podpore 2011/2)","(ni podpore 2011/2)","(ni podpore 2013)","(ni podpore 2013)",{"$f":"AW259-AU259","v":0},{"$f":"AX259-AV259","v":3.2199999999999989},0,2.4299999999999997]
["SE23-2014dec","3.2 Sončne elektrarne - ostale 2014 december",null,"srednja - od 1MW do vključno 10MW ","SE23",null,null,null,null,null,null,null,null,null,null,null,null,null,null,null,null,null,64.45,0,64.45,64.45,0,64.45,64.45,0,64.45,0.91,null,null,null,null,null,null,null,null,null,null,null,null,null,null,{"$f":"W260+X260","v":64.45},25.04,{"$f":"+Z260+AA260","v":64.45},28.37,64.45,30.88,null,"(ni podpore 2011/2)","(ni podpore 2011/2)","(ni podpore 2011/2)","(ni podpore 2011/2)","(ni podpore 2013)","(ni podpore 2013)",0,3.3300000000000018,0,2.509999999999998]
["SE24-2014dec","3.2 Sončne elektrarne - ostale 2014 december",null,"velika - nad 10MW do vključno 125MW","SE24",null,null,null,null,null,null,null,null,null,null,null,null,null,null,null,null,null,59.85,0,59.85,{"$f":"+W261","v":59.85},{"$f":"+X261","v":0},{"$f":"+Z261+AA261","v":59.85},59.85,0,59.85,1,null,null,null,null,null,null,null,null,null,null,null,null,null,null,"(ni ZO)",16.54,"(ni ZO)",20.2,"(ni ZO)",22.96,null,"(ni podpore 2011/2)","(ni podpore 2011/2)","(ni podpore 2011/2)","(ni podpore 2011/2)","(ni podpore 2013)","(ni podpore 2013)","(ni ZO)",3.66,"(ni ZO)",2.7600000000000016]
["GT01","4. Geotermalne elektrarne","4. Geotermalne elektrarne","mikro - manjše od 50kW","GT01",152.47,0,152.47,{"$f":"F262+G262","v":152.47},{"$f":"IF(H262=I262,\"OK\",\"razlika\")","v":"OK"},{"$f":"F262","v":152.47},0,152.47,{"$f":"F262","v":152.47},0,152.47,{"$f":"F262","v":152.47},0,152.47,{"$f":"F262","v":152.47},0,152.47,{"$f":"F262","v":152.47},0,{"$f":"W262+X262","v":152.47},{"$f":"+W262","v":152.47},{"$f":"+X262","v":0},{"$f":"+Z262+AA262","v":152.47},152.47,0,152.47,0.92,152.47,{"$f":"I262","v":152.47},{"$f":"IF(AG262=AH262,\"OK\",\"razlika\")","v":"OK"},"(indiv.)",{"$f":"ROUND(I262-AF262*$L$326,2)","v":92.67},{"$f":"IF(AJ262=AK262,\"OK\",\"razlika\")","v":"razlika"},{"$f":"K262+L262","v":152.47},{"$f":"ROUND((K262+L262)-AF262*$K$326,2)","v":103.33},{"$f":"N262+O262","v":152.47},{"$f":"ROUND((N262+O262)-AF262*$J$326,2)","v":103.59},{"$f":"Q262+R262","v":152.47},{"$f":"ROUND((Q262+R262)-AF262*$I$326,2)","v":101.14},{"$f":"T262+U262","v":152.47},{"$f":"ROUND((T262+U262)-AF262*$H$326,2)","v":105.86},{"$f":"W262+X262","v":152.47},112.62,{"$f":"+Z262+AA262","v":152.47},115.99,{"$f":"+AC262+AD262","v":152.47},118.53,"OP v Uredbi označena kot indivialno določena, čeprav stroški tabelirani",0,-2.4500000000000028,{"$f":"AS262-AQ262","v":0},{"$f":"AT262-AR262","v":4.7199999999999989},{"$f":"AU262-AS262","v":0},{"$f":"AV262-AT262","v":6.7600000000000051},0,3.3699999999999903,0,2.5400000000000063]
["GT02","4. Geotermalne elektrarne",null,"mala - manjše od 1MW","GT02",152.47,0,152.47,{"$f":"F263+G263","v":152.47},{"$f":"IF(H263=I263,\"OK\",\"razlika\")","v":"OK"},152.47,0,152.47,{"$f":"F263","v":152.47},0,152.47,{"$f":"F263","v":152.47},0,152.47,{"$f":"F263","v":152.47},0,152.47,{"$f":"F263","v":152.47},0,152.47,152.47,0,152.47,152.47,0,152.47,0.92,152.47,{"$f":"I263","v":152.47},"OK",92.67,{"$f":"ROUND(I263-AF263*$L$326,2)","v":92.67},"OK",{"$f":"K263+L263","v":152.47},{"$f":"ROUND((K263+L263)-AF263*$K$326,2)","v":103.33},{"$f":"N263+O263","v":152.47},{"$f":"ROUND((N263+O263)-AF263*$J$326,2)","v":103.59},{"$f":"Q263+R263","v":152.47},{"$f":"ROUND((Q263+R263)-AF263*$I$326,2)","v":101.14},{"$f":"T263+U263","v":152.47},{"$f":"ROUND((T263+U263)-AF263*$H$326,2)","v":105.86},{"$f":"W263+X263","v":152.47},112.62,{"$f":"+Z263+AA263","v":152.47},115.99,{"$f":"+AC263+AD263","v":152.47},{"$f":"ROUND((AC263+AD263)-AF263*$E$326,2)","v":118.53},null,0,-2.4500000000000028,0,4.7199999999999989,0,6.7600000000000051,0,3.3699999999999903,0,2.5400000000000063]
["GT03","4. Geotermalne elektrarne",null,"srednja - od 1MW do vključno 10MW ","GT03",152.47,0,152.47,{"$f":"F264+G264","v":152.47},{"$f":"IF(H264=I264,\"OK\",\"razlika\")","v":"OK"},152.47,0,152.47,{"$f":"F264","v":152.47},0,152.47,{"$f":"F264","v":152.47},0,152.47,{"$f":"F264","v":152.47},0,152.47,152.47,0,152.47,152.47,0,152.47,152.47,0,152.47,0.92,152.47,{"$f":"I264","v":152.47},"OK",92.67,{"$f":"ROUND(I264-AF264*$L$326,2)","v":92.67},"OK",{"$f":"K264+L264","v":152.47},{"$f":"ROUND((K264+L264)-AF264*$K$326,2)","v":103.33},{"$f":"N264+O264","v":152.47},{"$f":"ROUND((N264+O264)-AF264*$J$326,2)","v":103.59},{"$f":"Q264+R264","v":152.47},{"$f":"ROUND((Q264+R264)-AF264*$I$326,2)","v":101.14},{"$f":"T264+U264","v":152.47},{"$f":"ROUND((T264+U264)-AF264*$H$326,2)","v":105.86},{"$f":"W264+X264","v":152.47},112.62,{"$f":"+Z264+AA264","v":152.47},115.99,152.47,118.53,null,0,-2.4500000000000028,0,4.7199999999999989,0,6.7600000000000051,0,3.3699999999999903,0,2.5400000000000063]
["GT04","4. Geotermalne elektrarne",null,"velika - nad 10MW do vključno 125MW","GT04","(indvid.)",0,"(indvid.)","(indvid.)","(indvid.)","(indvid.)",0,"(indvid.)","(indvid.)",0,"(indvid.)","(indvid.)",0,"(indvid.)","(indvid.)",0,"(indvid.)","(indvid.)",0,"(indvid.)","(indvid.)",0,"(indvid.)","(indvid.)",0,"(indvid.)",0.92,"(ni ZO)","(ni ZO)","OK","(indvid.)","(indvid.)","OK","(ni ZO)","(indvid.)","(ni ZO)","(indvid.)","(ni ZO)","(indvid.)","(ni ZO)","(indvid.)","(ni ZO)","(indvid.)","(ni ZO)","(indvid.)","(ni ZO)","(indvid.)",null,"(ni ZO; individ.)","(individ.)","(ni ZO; individ.)","(individ.)","(ni ZO; individ.)","(individ.)","(ni ZO; individ.)","(individ.)","(ni ZO; individ.)","(individ.)"]
["LB11","5.1 Elektrarne na lesno biomaso","5.1 Elektrarne na lesno biomaso","mikro - manjše od 50kW","LB11","(indvid.)","(indvid.)","(indvid.)","(indvid.)","(indvid.)","(indvid.)","(indvid.)","(indvid.)","(indvid.)","(indvid.)","(indvid.)","(indvid.)","(indvid.)","(indvid.)","(indvid.)","(indvid.)","(indvid.)","(indvid.)","(indvid.)","(indvid.)","(indvid.)","(indvid.)","(indvid.)","(indvid.)","(indvid.)","(indvid.)",0.88,"(indvid.)","(indvid.)","OK","(indvid.)","(indvid.)","OK","(indvid.)","(indvid.)","(indvid.)","(indvid.)","(indvid.)","(indvid.)","(indvid.)","(indvid.)","(indvid.)","(indvid.)","(indvid.)","(indvid.)","(indvid.)","(indvid.)",null,"(individ.)","(individ.)","(individ.)","(individ.)","(individ.)","(individ.)","(individ.)","(individ.)","(individ.)","(individ.)"]
["LB12","5.1 Elektrarne na lesno biomaso",null,"mala - manjše od 1MW","LB12",161.94999999999999,62.4,224.35,{"$f":"F267+G267","v":224.35},{"$f":"IF(H267=I267,\"OK\",\"razlika\")","v":"OK"},161.94999999999999,{"$f":"ROUND(G267*$S$329,2)","v":63.79},225.73999999999998,{"$f":"F267","v":161.94999999999999},{"$f":"ROUND(G267*$R$329,2)","v":71.84},{"$f":"N267+O267","v":233.79},{"$f":"F267","v":161.94999999999999},{"$f":"ROUND(G267*$Q$329,2)","v":84.34},{"$f":"Q267+R267","v":246.29},{"$f":"F267","v":161.94999999999999},{"$f":"ROUND(G267*$P$329,2)","v":90.58},{"$f":"T267+U267","v":252.52999999999997},{"$f":"F267","v":161.94999999999999},{"$f":"ROUND(G267*$O$329,2)","v":90.15},{"$f":"W267+X267","v":252.1},{"$f":"+W267","v":161.94999999999999},{"$f":"ROUND(G267*$N$329,2)","v":88.49},{"$f":"+Z267+AA267","v":250.44},{"$f":"+Z267","v":161.94999999999999},{"$f":"ROUND(G267*$M$329,2)","v":81.86},{"$f":"+AC267+AD267","v":243.81},0.91,224.35,{"$f":"I267","v":224.35},"OK",165.2,{"$f":"ROUND(I267-AF267*$L$326,2)","v":165.2},"OK",{"$f":"K267+L267","v":225.73999999999998},{"$f":"ROUND((K267+L267)-AF267*$K$326,2)","v":177.14},{"$f":"N267+O267","v":233.79},{"$f":"ROUND((N267+O267)-AF267*$J$326,2)","v":185.44},{"$f":"Q267+R267","v":246.29},{"$f":"ROUND((Q267+R267)-AF267*$I$326,2)","v":195.52},{"$f":"T267+U267","v":252.52999999999997},{"$f":"ROUND((T267+U267)-AF267*$H$326,2)","v":206.43},{"$f":"W267+X267","v":252.1},{"$f":"ROUND((W267+X267)-AF267*$G$326,2)","v":212.69},{"$f":"+Z267+AA267","v":250.44},{"$f":"ROUND((Z267+AA267)-AF267*$F$326,2)","v":214.36},{"$f":"+AC267+AD267","v":243.81},{"$f":"ROUND((AC267+AD267)-AF267*$E$326,2)","v":210.24},null,12.5,10.080000000000013,{"$f":"AS267-AQ267","v":6.2399999999999807},{"$f":"AT267-AR267","v":10.909999999999997},{"$f":"AU267-AS267","v":-0.4299999999999784},{"$f":"AV267-AT267","v":6.2599999999999909},-1.6599999999999966,1.6700000000000159,-6.6299999999999955,-4.1200000000000045]
["LB13","5.1 Elektrarne na lesno biomaso",null,"srednja - od 1MW do vključno 10MW ","LB13",115.52,51.92,167.43,{"$f":"F268+G268","v":167.44},{"$f":"IF(H268=I268,\"OK\",\"razlika\")","v":"razlika"},115.52,{"$f":"ROUND(G268*$S$329,2)","v":53.08},168.6,{"$f":"F268","v":115.52},{"$f":"ROUND(G268*$R$329,2)","v":59.78},{"$f":"N268+O268","v":175.3},{"$f":"F268","v":115.52},{"$f":"ROUND(G268*$Q$329,2)","v":70.180000000000007},{"$f":"Q268+R268","v":185.7},{"$f":"F268","v":115.52},{"$f":"ROUND(G268*$P$329,2)","v":75.37},{"$f":"T268+U268","v":190.89},115.52,{"$f":"ROUND(G268*$O$329,2)","v":75.010000000000005},{"$f":"W268+X268","v":190.53},{"$f":"+W268","v":115.52},{"$f":"ROUND(G268*$N$329,2)","v":73.63},{"$f":"+Z268+AA268","v":189.14999999999998},{"$f":"+Z268","v":115.52},{"$f":"ROUND(G268*$M$329,2)","v":68.11},{"$f":"+AC268+AD268","v":183.63},0.92,167.43,{"$f":"I268","v":167.44},"razlika",107.63,{"$f":"ROUND(I268-AF268*$L$326,2)","v":107.64},"razlika",{"$f":"K268+L268","v":168.6},{"$f":"ROUND((K268+L268)-AF268*$K$326,2)","v":119.46},{"$f":"N268+O268","v":175.3},{"$f":"ROUND((N268+O268)-AF268*$J$326,2)","v":126.42},{"$f":"Q268+R268","v":185.7},{"$f":"ROUND((Q268+R268)-AF268*$I$326,2)","v":134.37},{"$f":"T268+U268","v":190.89},{"$f":"ROUND((T268+U268)-AF268*$H$326,2)","v":144.28},{"$f":"W268+X268","v":190.53},{"$f":"ROUND((W268+X268)-AF268*$G$326,2)","v":150.68},{"$f":"+Z268+AA268","v":189.14999999999998},{"$f":"ROUND((Z268+AA268)-AF268*$F$326,2)","v":152.66999999999999},183.63,149.69,"napačen seštevek RSEE v uredbi",10.399999999999977,7.9500000000000028,5.1899999999999977,9.9099999999999966,-0.35999999999998522,6.4000000000000057,-1.3800000000000239,1.9899999999999807,-5.5199999999999818,-2.9799999999999898]
["LB14","5.1 Elektrarne na lesno biomaso",null,"velika - nad 10MW do vključno 125MW","LB14","(indvid.)","(indvid.)","(indvid.)","(indvid.)","(indvid.)","(indvid.)","(indvid.)","(indvid.)","(indvid.)","(indvid.)","(indvid.)","(indvid.)","(indvid.)","(indvid.)","(indvid.)","(indvid.)","(indvid.)","(indvid.)","(indvid.)","(indvid.)","(indvid.)","(indvid.)","(indvid.)","(indvid.)","(indvid.)","(indvid.)",0.92,"(ni ZO)","(ni ZO)","OK","(indvid.)","(indvid.)","OK","(ni ZO)","(indvid.)","(ni ZO)","(indvid.)","(ni ZO)","(indvid.)","(ni ZO)","(indvid.)","(ni ZO)","(indvid.)","(ni ZO)","(indvid.)","(ni ZO)","(indvid.)",null,"(ni ZO; individ.)","(individ.)","(ni ZO; individ.)","(individ.)","(ni ZO; individ.)","(individ.)","(ni ZO; individ.)","(individ.)","(ni ZO; individ.)","(individ.)"]
["LB21","5.2.Sosežig lesne biomase >5%","5.2.Sosežig lesne biomase >5%","mikro - manjše od 50kW","LB21",51.34,51.2,102.54,{"$f":"F270+G270","v":102.54},{"$f":"IF(H270=I270,\"OK\",\"razlika\")","v":"OK"},51.34,{"$f":"ROUND(G270*$S$329,2)","v":52.34},103.68,{"$f":"F270","v":51.34},{"$f":"ROUND(G270*$R$329,2)","v":58.95},{"$f":"N270+O270","v":110.29},{"$f":"F270","v":51.34},{"$f":"ROUND(G270*$Q$329,2)","v":69.2},{"$f":"Q270+R270","v":120.54},{"$f":"F270","v":51.34},{"$f":"ROUND(G270*$P$329,2)","v":74.319999999999993},{"$f":"T270+U270","v":125.66},51.34,{"$f":"ROUND(G270*$O$329,2)","v":73.97},{"$f":"W270+X270","v":125.31},{"$f":"+W270","v":51.34},{"$f":"ROUND(G270*$N$329,2)","v":72.61},{"$f":"+Z270+AA270","v":123.95},{"$f":"+Z270","v":51.34},{"$f":"ROUND(G270*$M$329,2)","v":67.17},{"$f":"+AC270+AD270","v":118.51},0.88,"(ni ZO)","(ni ZO)","OK",42.74,{"$f":"ROUND(I270-AF270*$L$326,2)","v":45.34},"razlika","(ni ZO)",{"$f":"ROUND((K270+L270)-AF270*$K$326,2)","v":56.68},"(ni ZO)",{"$f":"ROUND((N270+O270)-AF270*$J$326,2)","v":63.54},"(ni ZO)",{"$f":"ROUND((Q270+R270)-AF270*$I$326,2)","v":71.44},"(ni ZO)",{"$f":"ROUND((T270+U270)-AF270*$H$326,2)","v":81.08},"(ni ZO)",{"$f":"ROUND((W270+X270)-AF270*$G$326,2)","v":87.2},"(ni ZO)",{"$f":"ROUND((Z270+AA270)-AF270*$F$326,2)","v":89.06},"(ni ZO)",86.05,"v izračunu OP v Uredbi uporabljen b 0,92 za vse kategorije, vendar ni podlage","(ni ZO)",7.8999999999999986,"(ni ZO)",{"$f":"AT270-AR270","v":9.64},"(ni ZO)",{"$f":"AV270-AT270","v":6.1200000000000045},"(ni ZO)",1.8599999999999994,"(ni ZO)",-3.0100000000000051]
["LB22","5.2.Sosežig lesne biomase >5%",null,"mala - manjše od 1MW","LB22",51.34,51.2,102.54,{"$f":"F271+G271","v":102.54},{"$f":"IF(H271=I271,\"OK\",\"razlika\")","v":"OK"},51.34,{"$f":"ROUND(G271*$S$329,2)","v":52.34},103.68,{"$f":"F271","v":51.34},{"$f":"ROUND(G271*$R$329,2)","v":58.95},{"$f":"N271+O271","v":110.29},{"$f":"F271","v":51.34},{"$f":"ROUND(G271*$Q$329,2)","v":69.2},{"$f":"Q271+R271","v":120.54},{"$f":"F271","v":51.34},{"$f":"ROUND(G271*$P$329,2)","v":74.319999999999993},{"$f":"T271+U271","v":125.66},51.34,{"$f":"ROUND(G271*$O$329,2)","v":73.97},{"$f":"W271+X271","v":125.31},51.34,{"$f":"ROUND(G271*$N$329,2)","v":72.61},123.95,51.34,{"$f":"ROUND(G271*$M$329,2)","v":67.17},118.51,0.91,"(ni ZO)","(ni ZO)","OK",42.74,{"$f":"ROUND(I271-AF271*$L$326,2)","v":43.39},"razlika","(ni ZO)",{"$f":"ROUND((K271+L271)-AF271*$K$326,2)","v":55.08},"(ni ZO)",{"$f":"ROUND((N271+O271)-AF271*$J$326,2)","v":61.94},"(ni ZO)",{"$f":"ROUND((Q271+R271)-AF271*$I$326,2)","v":69.77},"(ni ZO)",{"$f":"ROUND((T271+U271)-AF271*$H$326,2)","v":79.56},"(ni ZO)",{"$f":"ROUND((W271+X271)-AF271*$G$326,2)","v":85.9},"(ni ZO)",{"$f":"ROUND((Z271+AA271)-AF271*$F$326,2)","v":87.87},"(ni ZO)",84.94,"v izračunu OP v Uredbi uporabljen b 0,92 za vse kategorije, vendar ni podlage","(ni ZO)",{"$f":"AR271-AP271","v":7.8299999999999983},"(ni ZO)",9.7900000000000063,"(ni ZO)",6.3400000000000034,"(ni ZO)",1.9699999999999989,"(ni ZO)",-2.9300000000000068]
["LB23","5.2.Sosežig lesne biomase >5%",null,"srednja - od 1MW do vključno 10MW ","LB23",51.34,51.2,102.54,{"$f":"F272+G272","v":102.54},{"$f":"IF(H272=I272,\"OK\",\"razlika\")","v":"OK"},51.34,{"$f":"ROUND(G272*$S$329,2)","v":52.34},103.68,{"$f":"F272","v":51.34},{"$f":"ROUND(G272*$R$329,2)","v":58.95},{"$f":"N272+O272","v":110.29},{"$f":"F272","v":51.34},{"$f":"ROUND(G272*$Q$329,2)","v":69.2},{"$f":"Q272+R272","v":120.54},{"$f":"F272","v":51.34},{"$f":"ROUND(G272*$P$329,2)","v":74.319999999999993},{"$f":"T272+U272","v":125.66},51.34,{"$f":"ROUND(G272*$O$329,2)","v":73.97},{"$f":"W272+X272","v":125.31},51.34,{"$f":"ROUND(G272*$N$329,2)","v":72.61},123.95,51.34,67.17,118.51,0.92,"(ni ZO)","(ni ZO)","OK",42.74,{"$f":"ROUND(I272-AF272*$L$326,2)","v":42.74},"OK","(ni ZO)",{"$f":"ROUND((K272+L272)-AF272*$K$326,2)","v":54.54},"(ni ZO)",{"$f":"ROUND((N272+O272)-AF272*$J$326,2)","v":61.41},"(ni ZO)",{"$f":"ROUND((Q272+R272)-AF272*$I$326,2)","v":69.209999999999994},"(ni ZO)",{"$f":"ROUND((T272+U272)-AF272*$H$326,2)","v":79.05},"(ni ZO)",{"$f":"ROUND((W272+X272)-AF272*$G$326,2)","v":85.46},"(ni ZO)",{"$f":"ROUND((Z272+AA272)-AF272*$F$326,2)","v":87.47},"(ni ZO)",84.57,null,"(ni ZO)",7.7999999999999972,"(ni ZO)",9.8400000000000034,"(ni ZO)",6.4099999999999966,"(ni ZO)",2.0100000000000051,"(ni ZO)",-2.9000000000000057]
["LB24","5.2.Sosežig lesne biomase >5%",null,"velika - nad 10MW do vključno 125MW","LB24","(indvid.)","(indvid.)","(indvid.)","(indvid.)","(indvid.)","(indvid.)","(indvid.)","(indvid.)","(indvid.)","(indvid.)","(indvid.)","(indvid.)","(indvid.)","(indvid.)",null,null,"(indvid.)",null,null,"(indvid.)",null,null,"(indvid.)","(indvid.)","(indvid.)","(indvid.)",0.92,"(ni ZO)","(ni ZO)","OK","(indvid.)","(indvid.)","OK","(ni ZO)","(indvid.)","(ni ZO)","(indvid.)","(ni ZO)","(indvid.)","(ni ZO)","(indvid.)","(ni ZO)","(indvid.)","(ni ZO)","(indvid.)","(ni ZO)","(indvid.)",null,"(ni ZO; individ.)","(individ.)","(ni ZO; individ.)","(individ.)","(ni ZO; individ.)","(individ.)","(ni ZO; individ.)","(individ.)","(ni ZO; individ.)","(individ.)"]
["LB31","5.3.Sosežig lesne biomase <5%","5.3.Sosežig lesne biomase <5%","mikro - manjše od 50kW","LB31",0,26.4,26.4,{"$f":"F274+G274","v":26.4},{"$f":"IF(H274=I274,\"OK\",\"razlika\")","v":"OK"},0,{"$f":"$U$327","v":35.520000000000003},35.520000000000003,{"$f":"F274","v":0},{"$f":"$U$330","v":44.76},{"$f":"N274+O274","v":44.76},{"$f":"F274","v":0},{"$f":"$U$333","v":60.6},{"$f":"Q274+R274","v":60.6},{"$f":"F274","v":0},{"$f":"$U$336","v":67.92},{"$f":"T274+U274","v":67.92},{"$f":"F274","v":0},{"$f":"$U$339","v":68.28},{"$f":"W274+X274","v":68.28},{"$f":"+W274","v":0},{"$f":"$U$342","v":66.48},{"$f":"+Z274+AA274","v":66.48},{"$f":"+Z274","v":0},{"$f":"$U$345","v":59.28},{"$f":"+AC274+AD274","v":59.28},"OP=SDRS","(ni ZO)","(ni ZO)","OK",26.4,{"$f":"I274","v":26.4},"OK","(ni ZO)",{"$f":"M274","v":35.520000000000003},"(ni ZO)",{"$f":"P274","v":44.76},"(ni ZO)",{"$f":"S274","v":60.6},"(ni ZO)",{"$f":"V274","v":67.92},"(ni ZO)",{"$f":"Y274","v":68.28},"(ni ZO)",{"$f":"AB274","v":66.48},"(ni ZO)",{"$f":"AD274","v":59.28},null,"(ni ZO)",15.840000000000003,"(ni ZO)",{"$f":"AT274-AR274","v":7.32},"(ni ZO)",{"$f":"AV274-AT274","v":0.35999999999999943},"(ni ZO)",-1.7999999999999972,"(ni ZO)",-7.2000000000000028]
["LB32","5.3.Sosežig lesne biomase <5%",null,"mala - manjše od 1MW","LB32",0,26.4,26.4,26.4,"OK",0,{"$f":"$U$327","v":35.520000000000003},35.520000000000003,0,{"$f":"$U$330","v":44.76},44.76,0,{"$f":"$U$333","v":60.6},60.6,{"$f":"F275","v":0},{"$f":"$U$336","v":67.92},67.92,{"$f":"F275","v":0},{"$f":"$U$339","v":68.28},68.28,0,{"$f":"$U$342","v":66.48},{"$f":"+Z275+AA275","v":66.48},0,{"$f":"$U$345","v":59.28},{"$f":"+AC275+AD275","v":59.28},"OP=SDRS","(ni ZO)","(ni ZO)","OK",26.4,{"$f":"I275","v":26.4},"OK","(ni ZO)",{"$f":"M275","v":35.520000000000003},"(ni ZO)",{"$f":"P275","v":44.76},"(ni ZO)",{"$f":"S275","v":60.6},"(ni ZO)",{"$f":"V275","v":67.92},"(ni ZO)",{"$f":"Y275","v":68.28},"(ni ZO)",{"$f":"AB275","v":66.48},"(ni ZO)",{"$f":"AD275","v":59.28},null,"(ni ZO)",15.840000000000003,"(ni ZO)",7.32,"(ni ZO)",0.35999999999999943,"(ni ZO)",-1.7999999999999972,"(ni ZO)",-7.2000000000000028]
["LB33","5.3.Sosežig lesne biomase <5%",null,"srednja - od 1MW do vključno 10MW ","LB33",0,26.4,26.4,26.4,"OK",0,{"$f":"$U$327","v":35.520000000000003},35.520000000000003,0,{"$f":"$U$330","v":44.76},44.76,0,{"$f":"$U$333","v":60.6},60.6,0,67.92,67.92,0,68.28,68.28,0,66.48,66.48,0,59.28,59.28,"OP=SDRS","(ni ZO)","(ni ZO)","OK",26.4,{"$f":"I276","v":26.4},"OK","(ni ZO)",{"$f":"M276","v":35.520000000000003},"(ni ZO)",{"$f":"P276","v":44.76},"(ni ZO)",{"$f":"S276","v":60.6},"(ni ZO)",{"$f":"V276","v":67.92},"(ni ZO)",{"$f":"Y276","v":68.28},"(ni ZO)",{"$f":"AB276","v":66.48},"(ni ZO)",{"$f":"AD276","v":59.28},null,"(ni ZO)",15.840000000000003,"(ni ZO)",7.32,"(ni ZO)",0.35999999999999943,"(ni ZO)",-1.7999999999999972,"(ni ZO)",-7.2000000000000028]
["LB34","5.3.Sosežig lesne biomase <5%",null,"velika - nad 10MW do vključno 125MW","LB34",0,26.4,26.4,26.4,"OK",0,{"$f":"$U$327","v":35.520000000000003},35.520000000000003,0,{"$f":"$U$330","v":44.76},44.76,0,{"$f":"$U$333","v":60.6},60.6,0,67.92,67.92,0,68.28,68.28,0,66.48,66.48,0,59.28,59.28,"OP=SDRS","(ni ZO)","(ni ZO)","OK",26.4,{"$f":"I277","v":26.4},"OK","(ni ZO)",{"$f":"M277","v":35.520000000000003},"(ni ZO)",{"$f":"P277","v":44.76},"(ni ZO)",{"$f":"S277","v":60.6},"(ni ZO)",{"$f":"V277","v":67.92},"(ni ZO)",{"$f":"Y277","v":68.28},"(ni ZO)",{"$f":"AB277","v":66.48},"(ni ZO)",{"$f":"AD277","v":59.28},null,"(ni ZO)",15.840000000000003,"(ni ZO)",7.32,"(ni ZO)",0.35999999999999943,"(ni ZO)",-1.7999999999999972,"(ni ZO)",-7.2000000000000028]
["BP11","6.1 Bioplinske enote - biomasa","6.1 Bioplinske enote - biomasa","mikro - manjše od 50kW","BP11",118.72,41.33,160.05000000000001,160.05000000000001,"OK",118.72,{"$f":"ROUND(G278*$S$330+$E$336*(1-$S$330),2)","v":41.84},160.56,118.72,{"$f":"ROUND(G278*$R$330+$E$336*(1-$R$330),2)","v":41.84},160.56,118.72,{"$f":"ROUND(G278*$Q$330+$E$336*(1-$Q$330),2)","v":41.84},160.56,{"$f":"F278","v":118.72},{"$f":"ROUND(G278*$P$330+$E$336*(1-$P$330),2)","v":51.82},170.54,{"$f":"F278","v":118.72},{"$f":"ROUND(G278*$O$330+$E$336*(1-$O$330),2)","v":46.83},165.55,{"$f":"+W278","v":118.72},{"$f":"ROUND(G278*$N$330+$E$336*(1-$N$330),2)","v":50.99},{"$f":"+AA278+Z278","v":169.71},{"$f":"+Z278","v":118.72},{"$f":"ROUND(G278*$M$330+$E$336*(1-$M$330),2)","v":41.02},{"$f":"+AD278+AC278","v":159.74},0.88,160.05000000000001,{"$f":"I278","v":160.05000000000001},"OK",102.85,{"$f":"ROUND(I278-AF278*$L$326,2)","v":102.85},"OK",{"$f":"K278+L278","v":160.56},{"$f":"ROUND((K278+L278)-AF278*$K$326,2)","v":113.56},{"$f":"N278+O278","v":160.56},{"$f":"ROUND((N278+O278)-AF278*$J$326,2)","v":113.81},{"$f":"Q278+R278","v":160.56},{"$f":"ROUND((Q278+R278)-AF278*$I$326,2)","v":111.46},{"$f":"T278+U278","v":170.54},{"$f":"ROUND((T278+U278)-AF278*$H$326,2)","v":125.96},{"$f":"W278+X278","v":165.55},{"$f":"ROUND((W278+X278)-AF278*$G$326,2)","v":127.44},{"$f":"+Z278+AA278","v":169.71},{"$f":"ROUND((Z278+AA278)-AF278*$F$326,2)","v":134.82},{"$f":"+AC278+AD278","v":159.74},{"$f":"ROUND((AC278+AD278)-AF278*$E$326,2)","v":127.28},null,{"$f":"AQ278-AO278","v":0},-2.3500000000000085,{"$f":"AS278-AQ278","v":9.9799999999999898},14.5,{"$f":"AU278-AS278","v":-4.9899999999999807},1.480000000000004,4.1599999999999966,7.3799999999999955,-9.9699999999999989,-7.539999999999992]
["BP12","6.1 Bioplinske enote - biomasa",null,"mala - manjše od 1MW","BP12",111.75,44,155.76,155.75,"razlika",111.75,{"$f":"ROUND(G279*$S$330+$E$337*(1-$S$330),2)","v":44.56},156.31,111.75,{"$f":"ROUND(G279*$R$330+$E$337*(1-$R$330),2)","v":44.56},156.31,111.75,{"$f":"ROUND(G279*$Q$330+$E$337*(1-$Q$330),2)","v":44.56},156.31,{"$f":"F279","v":111.75},{"$f":"ROUND(G279*$P$330+$E$337*(1-$P$330),2)","v":55.44},167.19,{"$f":"F279","v":111.75},{"$f":"ROUND(G279*$O$330+$E$337*(1-$O$330),2)","v":50},161.75,{"$f":"+W279","v":111.75},{"$f":"ROUND(G279*$N$330+$E$337*(1-$N$330),2)","v":54.53},{"$f":"+AA279+Z279","v":166.28},{"$f":"+Z279","v":111.75},{"$f":"ROUND(G279*$M$330+$E$337*(1-$M$330),2)","v":43.66},{"$f":"+AD279+AC279","v":155.41},0.91,155.76,{"$f":"I279","v":155.75},"razlika",96.61,{"$f":"ROUND(I279-AF279*$L$326,2)","v":96.6},"razlika",{"$f":"K279+L279","v":156.31},{"$f":"ROUND((K279+L279)-AF279*$K$326,2)","v":107.71},{"$f":"N279+O279","v":156.31},{"$f":"ROUND((N279+O279)-AF279*$J$326,2)","v":107.96},{"$f":"Q279+R279","v":156.31},{"$f":"ROUND((Q279+R279)-AF279*$I$326,2)","v":105.54},{"$f":"T279+U279","v":167.19},{"$f":"ROUND((T279+U279)-AF279*$H$326,2)","v":121.09},{"$f":"W279+X279","v":161.75},{"$f":"ROUND((W279+X279)-AF279*$G$326,2)","v":122.34},{"$f":"+Z279+AA279","v":166.28},{"$f":"ROUND((Z279+AA279)-AF279*$F$326,2)","v":130.19999999999999},155.41,121.84,"napačen seštevek RSEE v uredbi",0,-2.4199999999999875,10.879999999999995,15.549999999999997,-5.4399999999999977,1.25,4.5300000000000011,7.8599999999999852,-10.870000000000005,-8.3599999999999852]
["BP13","6.1 Bioplinske enote - biomasa",null,"srednja - od 1MW do vključno 10MW ","BP13",96.18,44.59,140.77000000000001,140.77000000000001,"OK",96.18,{"$f":"ROUND(G280*$S$330+$E$338*(1-$S$330),2)","v":45.24},141.42000000000002,96.18,{"$f":"ROUND(G280*$R$330+$E$338*(1-$R$330),2)","v":45.24},141.42000000000002,96.18,{"$f":"ROUND(G280*$Q$330+$E$338*(1-$Q$330),2)","v":45.24},141.42000000000002,96.18,{"$f":"ROUND(G280*$P$330+$E$338*(1-$P$330),2)","v":57.94},154.12,96.18,{"$f":"ROUND(G280*$O$330+$E$338*(1-$O$330),2)","v":51.59},147.77000000000001,96.18,{"$f":"ROUND(G280*$N$330+$E$338*(1-$N$330),2)","v":56.88},153.06,96.18,{"$f":"ROUND(G280*$M$330+$E$338*(1-$M$330),2)","v":44.19},140.37,0.92,140.77000000000001,{"$f":"I280","v":140.77000000000001},"OK",80.97,{"$f":"ROUND(I280-AF280*$L$326,2)","v":80.97},"OK",{"$f":"K280+L280","v":141.42000000000002},{"$f":"ROUND((K280+L280)-AF280*$K$326,2)","v":92.28},{"$f":"N280+O280","v":141.42000000000002},{"$f":"ROUND((N280+O280)-AF280*$J$326,2)","v":92.54},{"$f":"Q280+R280","v":141.42000000000002},{"$f":"ROUND((Q280+R280)-AF280*$I$326,2)","v":90.09},{"$f":"T280+U280","v":154.12},{"$f":"ROUND((T280+U280)-AF280*$H$326,2)","v":107.51},{"$f":"W280+X280","v":147.77000000000001},{"$f":"ROUND((W280+X280)-AF280*$G$326,2)","v":107.92},{"$f":"+Z280+AA280","v":153.06},{"$f":"ROUND((Z280+AA280)-AF280*$F$326,2)","v":116.58},140.37,106.43,null,0,-2.4500000000000028,12.699999999999989,17.420000000000002,-6.3499999999999943,0.40999999999999659,5.289999999999992,8.6599999999999966,-12.689999999999998,-10.149999999999991]
["BP14","6.1 Bioplinske enote - biomasa",null,"velika - nad 10MW do vključno 125MW","BP14","(ni predv.)","(ni predv.)","(ni predv.)","(ni predv.)","(ni predv.)","(ni predv.)","(ni predv.)","(ni predv.)","(ni predv.)","(ni predv.)","(ni predv.)","(ni predv.)","(ni predv.)","(ni predv.)","(ni predv.)","(ni predv.)","(ni predv.)","(ni predv.)","(ni predv.)","(ni predv.)","(ni predv.)","(ni predv.)","(ni predv.)","(ni predv.)","(ni predv.)","(ni predv.)",1,"(ni predv.)","(ni predv.)","OK","(ni predv.)","(ni predv.)","OK","(ni predv.)","(ni predv.)","(ni predv.)","(ni predv.)","(ni predv.)","(ni predv.)","(ni predv.)","(ni predv.)","(ni predv.)","(ni predv.)","(ni predv.)","(ni predv.)","(ni predv.)","(ni predv.)",null,"(ni predv.)","(ni predv.)","(ni predv.)","(ni predv.)","(ni predv.)","(ni predv.)","(ni predv.)","(ni predv.)","(ni predv.)","(ni predv.)"]
["BP21","6.2 Bioplinske enote - odpadki","6.2 Bioplinske enote - odpadki","mikro - manjše od 50kW","BP21",139.22999999999999,0,139.22999999999999,{"$f":"F282+G282","v":139.22999999999999},{"$f":"IF(H282=I282,\"OK\",\"razlika\")","v":"OK"},139.22999999999999,0,139.22999999999999,{"$f":"F282","v":139.22999999999999},0,{"$f":"N282+O282","v":139.22999999999999},{"$f":"F282","v":139.22999999999999},0,{"$f":"Q282+R282","v":139.22999999999999},{"$f":"F282","v":139.22999999999999},0,{"$f":"T282+U282","v":139.22999999999999},{"$f":"F282","v":139.22999999999999},0,{"$f":"W282+X282","v":139.22999999999999},139.22999999999999,{"$f":"+X282","v":0},{"$f":"Z282+AA282","v":139.22999999999999},{"$f":"+Z282","v":139.22999999999999},{"$f":"+AA282","v":0},{"$f":"AC282+AD282","v":139.22999999999999},0.88,139.22999999999999,{"$f":"I282","v":139.22999999999999},"OK","(ni predv.)",{"$f":"ROUND(I282-AF282*$L$326,2)","v":82.03},"razlika",{"$f":"K282+L282","v":139.22999999999999},{"$f":"ROUND((K282+L282)-AF282*$K$326,2)","v":92.23},{"$f":"N282+O282","v":139.22999999999999},{"$f":"ROUND((N282+O282)-AF282*$J$326,2)","v":92.48},{"$f":"Q282+R282","v":139.22999999999999},{"$f":"ROUND((Q282+R282)-AF282*$I$326,2)","v":90.13},{"$f":"T282+U282","v":139.22999999999999},{"$f":"ROUND((T282+U282)-AF282*$H$326,2)","v":94.65},{"$f":"W282+X282","v":139.22999999999999},{"$f":"ROUND((W282+X282)-AF282*$G$326,2)","v":101.12},{"$f":"+Z282+AA282","v":139.22999999999999},{"$f":"ROUND((Z282+AA282)-AF282*$F$326,2)","v":104.34},{"$f":"+AC282+AD282","v":139.22999999999999},{"$f":"ROUND((AC282+AD282)-AF282*$E$326,2)","v":106.77},"OP v Uredbi označena kot da ni predvidena, vendar stroški tabelirani",0,-2.3500000000000085,{"$f":"AS282-AQ282","v":0},{"$f":"AT282-AR282","v":4.5200000000000102},{"$f":"AU282-AS282","v":0},{"$f":"AV282-AT282","v":6.4699999999999989},0,3.2199999999999989,{"$f":"AY282-AW282","v":0},{"$f":"AZ282-AX282","v":2.4299999999999926}]
["BP22","6.2 Bioplinske enote - odpadki",null,"mala - manjše od 1MW","BP22",139.22999999999999,0,139.22999999999999,{"$f":"F283+G283","v":139.22999999999999},{"$f":"IF(H283=I283,\"OK\",\"razlika\")","v":"OK"},139.22999999999999,0,139.22999999999999,{"$f":"F283","v":139.22999999999999},0,{"$f":"N283+O283","v":139.22999999999999},{"$f":"F283","v":139.22999999999999},0,{"$f":"Q283+R283","v":139.22999999999999},{"$f":"F283","v":139.22999999999999},0,{"$f":"T283+U283","v":139.22999999999999},{"$f":"F283","v":139.22999999999999},0,{"$f":"W283+X283","v":139.22999999999999},139.22999999999999,{"$f":"+X283","v":0},{"$f":"Z283+AA283","v":139.22999999999999},139.22999999999999,{"$f":"+AA283","v":0},{"$f":"AC283+AD283","v":139.22999999999999},0.91,139.22999999999999,{"$f":"I283","v":139.22999999999999},"OK",80.08,{"$f":"ROUND(I283-AF283*$L$326,2)","v":80.08},"OK",{"$f":"K283+L283","v":139.22999999999999},{"$f":"ROUND((K283+L283)-AF283*$K$326,2)","v":90.63},{"$f":"N283+O283","v":139.22999999999999},{"$f":"ROUND((N283+O283)-AF283*$J$326,2)","v":90.88},{"$f":"Q283+R283","v":139.22999999999999},{"$f":"ROUND((Q283+R283)-AF283*$I$326,2)","v":88.46},{"$f":"T283+U283","v":139.22999999999999},{"$f":"ROUND((T283+U283)-AF283*$H$326,2)","v":93.13},{"$f":"W283+X283","v":139.22999999999999},{"$f":"ROUND((W283+X283)-AF283*$G$326,2)","v":99.82},{"$f":"+Z283+AA283","v":139.22999999999999},{"$f":"ROUND((Z283+AA283)-AF283*$F$326,2)","v":103.15},139.22999999999999,105.66,null,0,-2.4200000000000017,0,4.6700000000000017,0,6.6899999999999977,0,3.3300000000000125,{"$f":"AY283-AW283","v":0},{"$f":"AZ283-AX283","v":2.5099999999999909}]
["BP23","6.2 Bioplinske enote - odpadki",null,"srednja - od 1MW do vključno 10MW ","BP23",129.15,0,129.15,{"$f":"F284+G284","v":129.15},{"$f":"IF(H284=I284,\"OK\",\"razlika\")","v":"OK"},129.15,0,129.15,{"$f":"F284","v":129.15},0,{"$f":"N284+O284","v":129.15},{"$f":"F284","v":129.15},0,{"$f":"Q284+R284","v":129.15},{"$f":"F284","v":129.15},0,{"$f":"T284+U284","v":129.15},129.15,0,{"$f":"W284+X284","v":129.15},129.15,0,{"$f":"Z284+AA284","v":129.15},129.15,0,{"$f":"AC284+AD284","v":129.15},0.92,129.15,{"$f":"I284","v":129.15},"OK",69.349999999999994,{"$f":"ROUND(I284-AF284*$L$326,2)","v":69.349999999999994},"OK",{"$f":"K284+L284","v":129.15},{"$f":"ROUND((K284+L284)-AF284*$K$326,2)","v":80.010000000000005},{"$f":"N284+O284","v":129.15},{"$f":"ROUND((N284+O284)-AF284*$J$326,2)","v":80.27},{"$f":"Q284+R284","v":129.15},{"$f":"ROUND((Q284+R284)-AF284*$I$326,2)","v":77.819999999999993},{"$f":"T284+U284","v":129.15},{"$f":"ROUND((T284+U284)-AF284*$H$326,2)","v":82.54},{"$f":"W284+X284","v":129.15},{"$f":"ROUND((W284+X284)-AF284*$G$326,2)","v":89.3},{"$f":"+Z284+AA284","v":129.15},{"$f":"ROUND((Z284+AA284)-AF284*$F$326,2)","v":92.67},129.15,95.21,null,0,-2.4500000000000028,0,4.7200000000000131,0,6.7599999999999909,0,3.3700000000000045,0,2.539999999999992]
["BP24","6.2 Bioplinske enote - odpadki",null,"velika - nad 10MW do vključno 125MW","BP24","(ni predv.)","(ni predv.)","(ni predv.)","(ni predv.)","(ni predv.)","(ni predv.)","(ni predv.)","(ni predv.)","(ni predv.)","(ni predv.)","(ni predv.)","(ni predv.)","(ni predv.)","(ni predv.)","(ni predv.)","(ni predv.)","(ni predv.)","(ni predv.)","(ni predv.)","(ni predv.)","(ni predv.)","(ni predv.)","(ni predv.)","(ni predv.)","(ni predv.)","(ni predv.)",1,"(ni predv.)","(ni predv.)","OK","(ni predv.)","(ni predv.)","OK","(ni predv.)","(ni predv.)","(ni predv.)","(ni predv.)","(ni predv.)","(ni predv.)","(ni predv.)","(ni predv.)","(ni predv.)","(ni predv.)","(ni predv.)","(ni predv.)","(ni predv.)","(ni predv.)",null,"(ni predv.)","(ni predv.)","(ni predv.)","(ni predv.)","(ni predv.)","(ni predv.)","(ni predv.)","(ni predv.)","(ni predv.)","(ni predv.)"]
["ČN01","7. Elektrarne na bioplin iz čistilnih naprav","7. Elektrarne na bioplin iz čistilnih naprav","mikro - manjše od 50kW","ČN01",85.84,0,85.84,{"$f":"F286+G286","v":85.84},{"$f":"IF(H286=I286,\"OK\",\"razlika\")","v":"OK"},85.84,0,85.84,{"$f":"F286","v":85.84},0,{"$f":"N286+O286","v":85.84},{"$f":"F286","v":85.84},0,{"$f":"Q286+R286","v":85.84},{"$f":"F286","v":85.84},0,{"$f":"T286+U286","v":85.84},{"$f":"F286","v":85.84},0,{"$f":"W286+X286","v":85.84},85.84,{"$f":"+X286","v":0},{"$f":"Z286+AA286","v":85.84},{"$f":"+Z286","v":85.84},{"$f":"+AA286","v":0},{"$f":"AC286+AD286","v":85.84},0.92,85.84,{"$f":"I286","v":85.84},"OK",26.04,{"$f":"ROUND(I286-AF286*$L$326,2)","v":26.04},"OK",{"$f":"K286+L286","v":85.84},{"$f":"ROUND((K286+L286)-AF286*$K$326,2)","v":36.700000000000003},{"$f":"N286+O286","v":85.84},{"$f":"ROUND((N286+O286)-AF286*$J$326,2)","v":36.96},{"$f":"Q286+R286","v":85.84},{"$f":"ROUND((Q286+R286)-AF286*$I$326,2)","v":34.51},{"$f":"T286+U286","v":85.84},{"$f":"ROUND((T286+U286)-AF286*$H$326,2)","v":39.229999999999997},{"$f":"W286+X286","v":85.84},{"$f":"ROUND((W286+X286)-AF286*$G$326,2)","v":45.99},{"$f":"+Z286+AA286","v":85.84},{"$f":"ROUND((Z286+AA286)-AF286*$F$326,2)","v":49.36},{"$f":"+AC286+AD286","v":85.84},{"$f":"ROUND((AC286+AD286)-AF286*$E$326,2)","v":51.9},null,0,-2.4500000000000028,{"$f":"AS286-AQ286","v":0},{"$f":"AT286-AR286","v":4.7199999999999989},{"$f":"AU286-AS286","v":0},{"$f":"AV286-AT286","v":6.7600000000000051},0,3.3699999999999974,0,2.5399999999999991]
["ČN02","7. Elektrarne na bioplin iz čistilnih naprav",null,"mala - manjše od 1MW","ČN02",74.42,0,74.42,{"$f":"F287+G287","v":74.42},{"$f":"IF(H287=I287,\"OK\",\"razlika\")","v":"OK"},74.42,0,74.42,{"$f":"F287","v":74.42},0,{"$f":"N287+O287","v":74.42},{"$f":"F287","v":74.42},0,{"$f":"Q287+R287","v":74.42},{"$f":"F287","v":74.42},0,{"$f":"T287+U287","v":74.42},{"$f":"F287","v":74.42},0,{"$f":"W287+X287","v":74.42},74.42,{"$f":"+X287","v":0},{"$f":"Z287+AA287","v":74.42},74.42,{"$f":"+AA287","v":0},{"$f":"AC287+AD287","v":74.42},0.92,74.42,{"$f":"I287","v":74.42},"OK",14.62,{"$f":"ROUND(I287-AF287*$L$326,2)","v":14.62},"OK",{"$f":"K287+L287","v":74.42},{"$f":"ROUND((K287+L287)-AF287*$K$326,2)","v":25.28},{"$f":"N287+O287","v":74.42},{"$f":"ROUND((N287+O287)-AF287*$J$326,2)","v":25.54},{"$f":"Q287+R287","v":74.42},{"$f":"ROUND((Q287+R287)-AF287*$I$326,2)","v":23.09},{"$f":"T287+U287","v":74.42},{"$f":"ROUND((T287+U287)-AF287*$H$326,2)","v":27.81},{"$f":"W287+X287","v":74.42},{"$f":"ROUND((W287+X287)-AF287*$G$326,2)","v":34.57},{"$f":"+Z287+AA287","v":74.42},{"$f":"ROUND((Z287+AA287)-AF287*$F$326,2)","v":37.94},74.42,40.479999999999997,null,0,-2.4499999999999993,0,4.7199999999999989,0,6.7600000000000016,0,3.3699999999999974,0,2.5399999999999991]
["ČN03","7. Elektrarne na bioplin iz čistilnih naprav",null,"srednja - od 1MW do vključno 10MW ","ČN03",66.09,0,66.09,{"$f":"F288+G288","v":66.09},{"$f":"IF(H288=I288,\"OK\",\"razlika\")","v":"OK"},66.09,0,66.09,{"$f":"F288","v":66.09},0,{"$f":"N288+O288","v":66.09},{"$f":"F288","v":66.09},0,{"$f":"Q288+R288","v":66.09},{"$f":"F288","v":66.09},0,{"$f":"T288+U288","v":66.09},66.09,0,{"$f":"W288+X288","v":66.09},66.09,0,{"$f":"Z288+AA288","v":66.09},66.09,0,{"$f":"AC288+AD288","v":66.09},0.92,66.09,{"$f":"I288","v":66.09},"OK",6.94,{"$f":"ROUND(I288-AF288*$L$326,2)","v":6.29},"razlika",{"$f":"K288+L288","v":66.09},{"$f":"ROUND((K288+L288)-AF288*$K$326,2)","v":16.95},{"$f":"N288+O288","v":66.09},{"$f":"ROUND((N288+O288)-AF288*$J$326,2)","v":17.21},{"$f":"Q288+R288","v":66.09},{"$f":"ROUND((Q288+R288)-AF288*$I$326,2)","v":14.76},{"$f":"T288+U288","v":66.09},{"$f":"ROUND((T288+U288)-AF288*$H$326,2)","v":19.48},{"$f":"W288+X288","v":66.09},{"$f":"ROUND((W288+X288)-AF288*$G$326,2)","v":26.24},{"$f":"+Z288+AA288","v":66.09},{"$f":"ROUND((Z288+AA288)-AF288*$F$326,2)","v":29.61},66.09,32.15,"napačen izračun OP v Uredbi za 2009",0,-2.4500000000000011,0,4.7200000000000006,0,6.759999999999998,0,3.370000000000001,0,2.5399999999999991]
["ČN04","7. Elektrarne na bioplin iz čistilnih naprav",null,"velika - nad 10MW do vključno 125MW","ČN04","(ni predv.)","(ni predv.)","(ni predv.)","(ni predv.)","(ni predv.)","(ni predv.)","(ni predv.)","(ni predv.)","(ni predv.)","(ni predv.)","(ni predv.)","(ni predv.)","(ni predv.)","(ni predv.)","(ni predv.)","(ni predv.)","(ni predv.)","(ni predv.)","(ni predv.)","(ni predv.)","(ni predv.)","(ni predv.)","(ni predv.)","(ni predv.)","(ni predv.)","(ni predv.)",1,"(ni predv.)","(ni predv.)","OK","(ni predv.)","(ni predv.)","OK","(ni predv.)","(ni predv.)","(ni predv.)","(ni predv.)","(ni predv.)","(ni predv.)","(ni predv.)","(ni predv.)","(ni predv.)","(ni predv.)","(ni predv.)","(ni predv.)","(ni predv.)","(ni predv.)",null,"(ni predv.)","(ni predv.)","(ni predv.)","(ni predv.)","(ni predv.)","(ni predv.)","(ni predv.)","(ni predv.)","(ni predv.)","(ni predv.)"]
["OP01","8. Elektrarne na odlagališčni plin","8. Elektrarne na odlagališčni plin","mikro - manjše od 50kW","OP01",99.33,0,99.33,{"$f":"F290+G290","v":99.33},{"$f":"IF(H290=I290,\"OK\",\"razlika\")","v":"OK"},99.33,0,99.33,{"$f":"F290","v":99.33},0,{"$f":"N290+O290","v":99.33},{"$f":"F290","v":99.33},0,{"$f":"Q290+R290","v":99.33},{"$f":"+F290","v":99.33},0,{"$f":"T290+U290","v":99.33},{"$f":"F290","v":99.33},0,{"$f":"W290+X290","v":99.33},99.33,{"$f":"+X290","v":0},{"$f":"Z290+AA290","v":99.33},{"$f":"+Z290","v":99.33},{"$f":"+AA290","v":0},{"$f":"AC290+AD290","v":99.33},0.92,99.33,{"$f":"I290","v":99.33},"OK",39.53,{"$f":"ROUND(I290-AF290*$L$326,2)","v":39.53},"OK",{"$f":"K290+L290","v":99.33},{"$f":"ROUND((K290+L290)-AF290*$K$326,2)","v":50.19},{"$f":"N290+O290","v":99.33},{"$f":"ROUND((N290+O290)-AF290*$J$326,2)","v":50.45},{"$f":"Q290+R290","v":99.33},{"$f":"ROUND((Q290+R290)-AF290*$I$326,2)","v":48},{"$f":"T290+U290","v":99.33},{"$f":"ROUND((T290+U290)-AF290*$H$326,2)","v":52.72},{"$f":"W290+X290","v":99.33},{"$f":"ROUND((W290+X290)-AF290*$G$326,2)","v":59.48},{"$f":"+Z290+AA290","v":99.33},{"$f":"ROUND((Z290+AA290)-AF290*$F$326,2)","v":62.85},{"$f":"+AC290+AD290","v":99.33},{"$f":"ROUND((AC290+AD290)-AF290*$E$326,2)","v":65.39},null,0,-2.4500000000000028,{"$f":"AS290-AQ290","v":0},{"$f":"AT290-AR290","v":4.7199999999999989},{"$f":"AU290-AS290","v":0},{"$f":"AV290-AT290","v":6.759999999999998},0,3.3700000000000045,0,2.5399999999999991]
["OP02","8. Elektrarne na odlagališčni plin",null,"mala - manjše od 1MW","OP02",67.47,0,67.47,{"$f":"F291+G291","v":67.47},{"$f":"IF(H291=I291,\"OK\",\"razlika\")","v":"OK"},67.47,0,67.47,{"$f":"F291","v":67.47},0,{"$f":"N291+O291","v":67.47},{"$f":"F291","v":67.47},0,{"$f":"Q291+R291","v":67.47},{"$f":"+F291","v":67.47},0,{"$f":"T291+U291","v":67.47},{"$f":"F291","v":67.47},0,{"$f":"W291+X291","v":67.47},67.47,{"$f":"+X291","v":0},{"$f":"Z291+AA291","v":67.47},67.47,{"$f":"+AA291","v":0},{"$f":"AC291+AD291","v":67.47},0.92,67.47,{"$f":"I291","v":67.47},"OK",7.67,{"$f":"ROUND(I291-AF291*$L$326,2)","v":7.67},"OK",{"$f":"K291+L291","v":67.47},{"$f":"ROUND((K291+L291)-AF291*$K$326,2)","v":18.329999999999998},{"$f":"N291+O291","v":67.47},{"$f":"ROUND((N291+O291)-AF291*$J$326,2)","v":18.59},{"$f":"Q291+R291","v":67.47},{"$f":"ROUND((Q291+R291)-AF291*$I$326,2)","v":16.14},{"$f":"T291+U291","v":67.47},{"$f":"ROUND((T291+U291)-AF291*$H$326,2)","v":20.86},{"$f":"W291+X291","v":67.47},{"$f":"ROUND((W291+X291)-AF291*$G$326,2)","v":27.62},{"$f":"+Z291+AA291","v":67.47},{"$f":"ROUND((Z291+AA291)-AF291*$F$326,2)","v":30.99},67.47,33.53,null,0,-2.4499999999999993,0,4.7199999999999989,0,6.7600000000000016,0,3.3699999999999974,0,2.5400000000000027]
["OP03","8. Elektrarne na odlagališčni plin",null,"srednja - od 1MW do vključno 10MW ","OP03",61.67,0,61.67,{"$f":"F292+G292","v":61.67},{"$f":"IF(H292=I292,\"OK\",\"razlika\")","v":"OK"},61.67,0,61.67,{"$f":"F292","v":61.67},0,{"$f":"N292+O292","v":61.67},{"$f":"F292","v":61.67},0,{"$f":"Q292+R292","v":61.67},{"$f":"+F292","v":61.67},0,{"$f":"T292+U292","v":61.67},61.67,0,{"$f":"W292+X292","v":61.67},61.67,0,{"$f":"Z292+AA292","v":61.67},61.67,0,{"$f":"AC292+AD292","v":61.67},0.92,61.67,{"$f":"I292","v":61.67},"OK",2.52,{"$f":"ROUND(I292-AF292*$L$326,2)","v":1.87},"razlika",{"$f":"K292+L292","v":61.67},{"$f":"ROUND((K292+L292)-AF292*$K$326,2)","v":12.53},{"$f":"N292+O292","v":61.67},{"$f":"ROUND((N292+O292)-AF292*$J$326,2)","v":12.79},{"$f":"Q292+R292","v":61.67},{"$f":"ROUND((Q292+R292)-AF292*$I$326,2)","v":10.34},{"$f":"T292+U292","v":61.67},{"$f":"ROUND((T292+U292)-AF292*$H$326,2)","v":15.06},{"$f":"W292+X292","v":61.67},{"$f":"ROUND((W292+X292)-AF292*$G$326,2)","v":21.82},{"$f":"+Z292+AA292","v":61.67},{"$f":"ROUND((Z292+AA292)-AF292*$F$326,2)","v":25.19},61.67,27.73,"napačen izračun OP v Uredbi za 2009",0,-2.4499999999999993,0,4.7200000000000006,0,6.76,0,3.370000000000001,0,2.5399999999999991]
["OP04","8. Elektrarne na odlagališčni plin",null,"velika - nad 10MW do vključno 125MW","OP04","(ni predv.)","(ni predv.)","(ni predv.)","(ni predv.)","(ni predv.)","(ni predv.)","(ni predv.)","(ni predv.)","(ni predv.)","(ni predv.)","(ni predv.)","(ni predv.)","(ni predv.)","(ni predv.)","(ni predv.)","(ni predv.)","(ni predv.)","(ni predv.)","(ni predv.)","(ni predv.)","(ni predv.)","(ni predv.)","(ni predv.)","(ni predv.)","(ni predv.)","(ni predv.)",1,"(ni predv.)","(ni predv.)","OK","(ni predv.)","(ni predv.)","OK","(ni predv.)","(ni predv.)","(ni predv.)","(ni predv.)","(ni predv.)","(ni predv.)","(ni predv.)","(ni predv.)","(ni predv.)","(ni predv.)","(ni predv.)","(ni predv.)","(ni predv.)","(ni predv.)",null,"(ni predv.)","(ni predv.)","(ni predv.)","(ni predv.)","(ni predv.)","(ni predv.)","(ni predv.)","(ni predv.)","(ni predv.)","(ni predv.)"]
["BO01","9. Elektrarne na biološko razgradljive odpadke","9. Elektrarne na biološko razgradljive odpadke","mikro - manjše od 50kW","BO01","(ni predv.)","(ni predv.)","(ni predv.)","(ni predv.)","(ni predv.)","(ni predv.)","(ni predv.)","(ni predv.)","(ni predv.)","(ni predv.)","(ni predv.)","(ni predv.)","(ni predv.)","(ni predv.)","(ni predv.)","(ni predv.)","(ni predv.)","(ni predv.)","(ni predv.)","(ni predv.)","(ni predv.)","(ni predv.)","(ni predv.)","(ni predv.)","(ni predv.)","(ni predv.)",0.92,"(ni predv.)","(ni predv.)","OK","(ni predv.)","(ni predv.)","OK","(ni predv.)","(ni predv.)","(ni predv.)","(ni predv.)","(ni predv.)","(ni predv.)","(ni predv.)","(ni predv.)","(ni predv.)","(ni predv.)","(ni predv.)","(ni predv.)","(ni predv.)","(ni predv.)",null,"(ni predv.)","(ni predv.)","(ni predv.)","(ni predv.)","(ni predv.)","(ni predv.)","(ni predv.)","(ni predv.)","(ni predv.)","(ni predv.)"]
["BO02","9. Elektrarne na biološko razgradljive odpadke",null,"mala - manjše od 1MW","BO02",77.44,0,77.44,{"$f":"F295+G295","v":77.44},{"$f":"IF(H295=I295,\"OK\",\"razlika\")","v":"OK"},77.44,0,{"$f":"K295+L295","v":77.44},{"$f":"F295","v":77.44},0,{"$f":"N295+O295","v":77.44},{"$f":"F295","v":77.44},0,{"$f":"Q295+R295","v":77.44},{"$f":"F295","v":77.44},0,{"$f":"T295+U295","v":77.44},{"$f":"F295","v":77.44},0,{"$f":"W295+X295","v":77.44},77.44,0,{"$f":"Z295+AA295","v":77.44},{"$f":"+Z295","v":77.44},{"$f":"+AA295","v":0},{"$f":"AC295+AD295","v":77.44},0.92,77.44,{"$f":"I295","v":77.44},"OK",17.64,{"$f":"ROUND(I295-AF295*$L$326,2)","v":17.64},"OK",{"$f":"K295+L295","v":77.44},{"$f":"ROUND((K295+L295)-AF295*$K$326,2)","v":28.3},{"$f":"N295+O295","v":77.44},{"$f":"ROUND((N295+O295)-AF295*$J$326,2)","v":28.56},{"$f":"Q295+R295","v":77.44},{"$f":"ROUND((Q295+R295)-AF295*$I$326,2)","v":26.11},{"$f":"T295+U295","v":77.44},{"$f":"ROUND((T295+U295)-AF295*$H$326,2)","v":30.83},{"$f":"W295+X295","v":77.44},{"$f":"ROUND((W295+X295)-AF295*$G$326,2)","v":37.590000000000003},{"$f":"+Z295+AA295","v":77.44},{"$f":"ROUND((Z295+AA295)-AF295*$F$326,2)","v":40.96},{"$f":"+AC295+AD295","v":77.44},{"$f":"ROUND((AC295+AD295)-AF295*$E$326,2)","v":43.5},null,0,-2.4499999999999993,{"$f":"AS295-AQ295","v":0},{"$f":"AT295-AR295","v":4.7199999999999989},{"$f":"AU295-AS295","v":0},{"$f":"AV295-AT295","v":6.7600000000000051},0,3.3699999999999974,0,2.5399999999999991]
["BO03","9. Elektrarne na biološko razgradljive odpadke",null,"srednja - od 1MW do vključno 10MW ","BO03",74.34,0,74.34,{"$f":"F296+G296","v":74.34},{"$f":"IF(H296=I296,\"OK\",\"razlika\")","v":"OK"},74.34,0,74.34,{"$f":"F296","v":74.34},0,{"$f":"N296+O296","v":74.34},{"$f":"F296","v":74.34},0,{"$f":"Q296+R296","v":74.34},{"$f":"F296","v":74.34},0,{"$f":"T296+U296","v":74.34},{"$f":"F296","v":74.34},0,{"$f":"W296+X296","v":74.34},74.34,0,74.34,74.34,0,74.34,0.92,74.34,{"$f":"I296","v":74.34},"OK",14.54,{"$f":"ROUND(I296-AF296*$L$326,2)","v":14.54},"OK",{"$f":"K296+L296","v":74.34},{"$f":"ROUND((K296+L296)-AF296*$K$326,2)","v":25.2},{"$f":"N296+O296","v":74.34},{"$f":"ROUND((N296+O296)-AF296*$J$326,2)","v":25.46},{"$f":"Q296+R296","v":74.34},{"$f":"ROUND((Q296+R296)-AF296*$I$326,2)","v":23.01},{"$f":"T296+U296","v":74.34},{"$f":"ROUND((T296+U296)-AF296*$H$326,2)","v":27.73},{"$f":"W296+X296","v":74.34},{"$f":"ROUND((W296+X296)-AF296*$G$326,2)","v":34.49},{"$f":"+Z296+AA296","v":74.34},{"$f":"ROUND((Z296+AA296)-AF296*$F$326,2)","v":37.86},74.34,40.4,null,0,-2.4499999999999993,0,4.7199999999999989,0,6.7600000000000016,0,3.3699999999999974,0,2.5399999999999991]
["BO04","9. Elektrarne na biološko razgradljive odpadke",null,"velika - nad 10MW do vključno 125MW","BO04","(indvid.)",0,"(indvid.)","(indvid.)","(indvid.)","(indvid.)",0,"(indvid.)","(indvid.)",0,"(indvid.)","(indvid.)",0,"(indvid.)","(indvid.)",0,"(indvid.)","(indvid.)",0,"(indvid.)","(indvid.)",{"$f":"+X297","v":0},{"$f":"+Y297","v":"(indvid.)"},"(indvid.)",0,"(indvid.)",0.92,"(ni ZO)","(ni ZO)","OK","(ni predv.)","(indvid.)","razlika","(ni ZO)","(indvid.)","(ni ZO)","(indvid.)","(ni ZO)","(indvid.)","(ni ZO)","(indvid.)","(ni ZO)","(indvid.)","(ni ZO)","(indvid.)","(ni ZO)","(indvid.)","OP v Uredbi označena kot da ni predvidena, pri stroških piše \"individualno\"","(ni ZO; individ.)","(individ.)","(ni ZO; individ.)","(individ.)","(ni ZO; individ.)","(individ.)","(ni ZO; individ.)","(individ.)","(ni ZO; individ.)","(individ.)"]
["SL11","10. SPTE na lesno biomaso (do 4.000 ur)","10. SPTE na lesno biomaso (do 4.000 ur)","mikro - manjše od 50kW","SL11","(indvid.)","(indvid.)","(indvid.)","(indvid.)","(indvid.)","(indvid.)","(indvid.)","(indvid.)","(indvid.)","(indvid.)","(indvid.)","(indvid.)","(indvid.)","(indvid.)","(indvid.)","(indvid.)","(indvid.)","(indvid.)","(indvid.)","(indvid.)","(indvid.)","(indvid.)","(indvid.)","(indvid.)","(indvid.)","(indvid.)",0.85,"(indvid.)","(indvid.)","OK","(indvid.)","(indvid.)","OK","(indvid.)","(indvid.)","(indvid.)","(indvid.)","(indvid.)","(indvid.)","(indvid.)","(indvid.)","(indvid.)","(indvid.)","(indvid.)","(indvid.)","(indvid.)","(indvid.)",null,"(individ.)","(individ.)","(individ.)","(individ.)","(individ.)","(individ.)","(individ.)","(individ.)","(individ.)","(individ.)"]
["SL12","10. SPTE na lesno biomaso (do 4.000 ur)",null,"mala - manjše od 1MW","SL12",293.27,33.43,326.7,{"$f":"F299+G299","v":326.7},{"$f":"IF(H299=I299,\"OK\",\"razlika\")","v":"OK"},293.27,{"$f":"ROUND(G299*$S$329,2)","v":34.18},327.45,{"$f":"F299","v":293.27},{"$f":"ROUND(G299*$R$329,2)","v":38.49},{"$f":"N299+O299","v":331.76},{"$f":"F299","v":293.27},{"$f":"ROUND(G299*$Q$329,2)","v":45.18},{"$f":"Q299+R299","v":338.45},{"$f":"F299","v":293.27},{"$f":"ROUND(G299*$P$329,2)","v":48.53},{"$f":"T299+U299","v":341.79999999999995},{"$f":"F299","v":293.27},{"$f":"ROUND(G299*$O$329,2)","v":48.3},{"$f":"W299+X299","v":341.57},293.27,{"$f":"ROUND(G299*$N$329,2)","v":47.41},{"$f":"Z299+AA299","v":340.67999999999995},{"$f":"+Z299","v":293.27},{"$f":"ROUND(G299*$M$329,2)","v":43.86},{"$f":"AC299+AD299","v":337.13},0.88,326.7,{"$f":"I299","v":326.7},"OK",269.5,{"$f":"ROUND(I299-AF299*$L$326,2)","v":269.5},"OK",{"$f":"K299+L299","v":327.45},{"$f":"ROUND((K299+L299)-AF299*$K$326,2)","v":280.45},{"$f":"N299+O299","v":331.76},{"$f":"ROUND((N299+O299)-AF299*$J$326,2)","v":285.01},{"$f":"Q299+R299","v":338.45},{"$f":"ROUND((Q299+R299)-AF299*$I$326,2)","v":289.35000000000002},{"$f":"T299+U299","v":341.79999999999995},{"$f":"ROUND((T299+U299)-AF299*$H$326,2)","v":297.22000000000003},{"$f":"W299+X299","v":341.57},{"$f":"ROUND((W299+X299)-AF299*$G$326,2)","v":303.45999999999998},{"$f":"+Z299+AA299","v":340.67999999999995},{"$f":"ROUND((Z299+AA299)-AF299*$F$326,2)","v":305.79000000000002},{"$f":"+AC299+AD299","v":337.13},{"$f":"ROUND((AC299+AD299)-AF299*$E$326,2)","v":304.67},null,6.6899999999999977,4.3400000000000318,{"$f":"AS299-AQ299","v":3.3499999999999659},{"$f":"AT299-AR299","v":7.8700000000000045},{"$f":"AU299-AS299","v":-0.22999999999996135},{"$f":"AV299-AT299","v":6.2399999999999523},-0.8900000000000432,2.3300000000000409,-3.5499999999999545,-1.1200000000000045]
["SL13","10. SPTE na lesno biomaso (do 4.000 ur)",null,"srednja - nižja - od 1MW do vključno 5MW","SL13",221.27,31.46,252.73,{"$f":"F300+G300","v":252.73000000000002},{"$f":"IF(H300=I300,\"OK\",\"razlika\")","v":"OK"},221.27,{"$f":"ROUND(G300*$S$329,2)","v":32.159999999999997},253.43,{"$f":"F300","v":221.27},{"$f":"ROUND(G300*$R$329,2)","v":36.22},{"$f":"N300+O300","v":257.49},{"$f":"F300","v":221.27},{"$f":"ROUND(G300*$Q$329,2)","v":42.52},{"$f":"Q300+R300","v":263.79000000000002},{"$f":"F300","v":221.27},{"$f":"ROUND(G300*$P$329,2)","v":45.67},{"$f":"T300+U300","v":266.94},{"$f":"F300","v":221.27},{"$f":"ROUND(G300*$O$329,2)","v":45.45},{"$f":"W300+X300","v":266.72000000000003},221.27,{"$f":"ROUND(G300*$N$329,2)","v":44.61},{"$f":"Z300+AA300","v":265.88},221.27,{"$f":"ROUND(G300*$M$329,2)","v":41.27},{"$f":"AC300+AD300","v":262.54000000000002},0.93,"(ni ZO)","(ni ZO)","OK",192.28,{"$f":"ROUND(I300-AF300*$L$326,2)","v":192.28},"OK","(ni ZO)",{"$f":"ROUND((K300+L300)-AF300*$K$326,2)","v":203.76},"(ni ZO)",{"$f":"ROUND((N300+O300)-AF300*$J$326,2)","v":208.08},"(ni ZO)",{"$f":"ROUND((Q300+R300)-AF300*$I$326,2)","v":211.91},"(ni ZO)",{"$f":"ROUND((T300+U300)-AF300*$H$326,2)","v":219.83},"(ni ZO)",{"$f":"ROUND((W300+X300)-AF300*$G$326,2)","v":226.44},"(ni ZO)",{"$f":"ROUND((Z300+AA300)-AF300*$F$326,2)","v":229.01},"(ni ZO)",228.23,null,"(ni ZO)",3.8299999999999841,"(ni ZO)",7.9200000000000159,"(ni ZO)",6.6099999999999852,"(ni ZO)",2.5699999999999932,"(ni ZO)",-0.78000000000000114]
["SL14","10. SPTE na lesno biomaso (do 4.000 ur)",null,"srednja - višja - nad 5MW do vključno 25MW","SL14",159.27000000000001,27.73,187.01,{"$f":"F301+G301","v":187},{"$f":"IF(H301=I301,\"OK\",\"razlika\")","v":"razlika"},159.27000000000001,{"$f":"ROUND(G301*$S$329,2)","v":28.35},187.62,{"$f":"F301","v":159.27000000000001},{"$f":"ROUND(G301*$R$329,2)","v":31.93},{"$f":"N301+O301","v":191.20000000000002},{"$f":"F301","v":159.27000000000001},{"$f":"ROUND(G301*$Q$329,2)","v":37.479999999999997},{"$f":"Q301+R301","v":196.75},159.27000000000001,{"$f":"ROUND(G301*$P$329,2)","v":40.25},{"$f":"T301+U301","v":199.52},159.27000000000001,{"$f":"ROUND(G301*$O$329,2)","v":40.06},{"$f":"W301+X301","v":199.33},159.27000000000001,{"$f":"ROUND(G301*$N$329,2)","v":39.32},198.59,159.27000000000001,36.380000000000003,195.65,0.93,"(ni ZO)","(ni ZO)","OK",126.56,{"$f":"ROUND(I301-AF301*$L$326,2)","v":126.55},"razlika","(ni ZO)",{"$f":"ROUND((K301+L301)-AF301*$K$326,2)","v":137.94999999999999},"(ni ZO)",{"$f":"ROUND((N301+O301)-AF301*$J$326,2)","v":141.79},"(ni ZO)",{"$f":"ROUND((Q301+R301)-AF301*$I$326,2)","v":144.87},"(ni ZO)",{"$f":"ROUND((T301+U301)-AF301*$H$326,2)","v":152.41},"(ni ZO)",{"$f":"ROUND((W301+X301)-AF301*$G$326,2)","v":159.05000000000001},"(ni ZO)",{"$f":"ROUND((Z301+AA301)-AF301*$F$326,2)","v":161.72},"(ni ZO)",161.34,"napačen seštevek RSEE v uredbi","(ni ZO)",3.0800000000000125,"(ni ZO)",7.539999999999992,"(ni ZO)",6.6400000000000148,"(ni ZO)",2.6699999999999875,"(ni ZO)",-0.37999999999999545]
["SL15","10. SPTE na lesno biomaso (do 4.000 ur)",null,"velika - nižja - nad 25MW do vključno 50MW","SL15",127.05,28.65,155.71,{"$f":"F302+G302","v":155.69999999999999},{"$f":"IF(H302=I302,\"OK\",\"razlika\")","v":"razlika"},127.05,{"$f":"ROUND(G302*$S$329,2)","v":29.29},156.34,{"$f":"F302","v":127.05},{"$f":"ROUND(G302*$R$329,2)","v":32.99},{"$f":"N302+O302","v":160.04},{"$f":"F302","v":127.05},{"$f":"ROUND(G302*$Q$329,2)","v":38.72},{"$f":"Q302+R302","v":165.76999999999998},127.05,{"$f":"ROUND(G302*$P$329,2)","v":41.59},{"$f":"T302+U302","v":168.64},127.05,{"$f":"ROUND(G302*$O$329,2)","v":41.39},{"$f":"W302+X302","v":168.44},127.05,{"$f":"ROUND(G302*$N$329,2)","v":40.630000000000003},167.68,127.05,37.590000000000003,164.64,0.96,"(ni ZO)","(ni ZO)","OK",93.31,{"$f":"ROUND(I302-AF302*$L$326,2)","v":93.3},"razlika","(ni ZO)",{"$f":"ROUND((K302+L302)-AF302*$K$326,2)","v":105.07},"(ni ZO)",{"$f":"ROUND((N302+O302)-AF302*$J$326,2)","v":109.04},"(ni ZO)",{"$f":"ROUND((Q302+R302)-AF302*$I$326,2)","v":112.21},"(ni ZO)",{"$f":"ROUND((T302+U302)-AF302*$H$326,2)","v":120.01},"(ni ZO)",{"$f":"ROUND((W302+X302)-AF302*$G$326,2)","v":126.86},"(ni ZO)",{"$f":"ROUND((Z302+AA302)-AF302*$F$326,2)","v":129.62},"(ni ZO)",129.22999999999999,"napačen seštevek RSEE v uredbi","(ni ZO)",3.1699999999999875,"(ni ZO)",7.8000000000000114,"(ni ZO)",6.8499999999999943,"(ni ZO)",2.7600000000000051,"(ni ZO)",-0.39000000000001478]
["SL16","10. SPTE na lesno biomaso (do 4.000 ur)",null,"velika - višja - nad 50MW do 200MW","SL16","(indvid.)","(indvid.)","(indvid.)","(indvid.)","(indvid.)","(indvid.)","(indvid.)","(indvid.)","(indvid.)","(indvid.)","(indvid.)","(indvid.)","(indvid.)","(indvid.)","(indvid.)","(indvid.)","(indvid.)","(indvid.)","(indvid.)","(indvid.)","(indvid.)","(indvid.)","(indvid.)","(indvid.)","(indvid.)","(indvid.)",0.96,"(ni ZO)","(ni ZO)","OK","(indvid.)","(indvid.)","OK","(ni ZO)","(indvid.)","(ni ZO)","(indvid.)","(ni ZO)","(indvid.)","(ni ZO)","(indvid.)","(ni ZO)","(indvid.)","(ni ZO)","(indvid.)","(ni ZO)","(indvid.)",null,"(ni ZO; individ.)","(individ.)","(ni ZO; individ.)","(individ.)","(ni ZO; individ.)","(individ.)","(ni ZO; individ.)","(individ.)","(ni ZO; individ.)","(individ.)"]
["SL21","10. SPTE na lesno biomaso (več kot 4.000 ur)","10. SPTE na lesno biomaso (več kot 4.000 ur)","mikro - manjše od 50kW","SL21","(indvid.)","(indvid.)","(indvid.)","(indvid.)","(indvid.)","(indvid.)","(indvid.)","(indvid.)","(indvid.)","(indvid.)","(indvid.)","(indvid.)","(indvid.)","(indvid.)","(indvid.)","(indvid.)","(indvid.)","(indvid.)","(indvid.)","(indvid.)","(indvid.)","(indvid.)","(indvid.)","(indvid.)","(indvid.)","(indvid.)",0.9,"(indvid.)","(indvid.)","OK","(indvid.)","(indvid.)","OK","(indvid.)","(indvid.)","(indvid.)","(indvid.)","(indvid.)","(indvid.)","(indvid.)","(indvid.)","(indvid.)","(indvid.)","(indvid.)","(indvid.)","(indvid.)","(indvid.)",null,"(individ.)","(individ.)","(individ.)","(individ.)","(individ.)","(individ.)","(individ.)","(individ.)","(individ.)","(individ.)"]
["SL22","10. SPTE na lesno biomaso (več kot 4.000 ur)",null,"mala - manjše od 1MW","SL22",186.62,33.43,220.05,{"$f":"F305+G305","v":220.05},{"$f":"IF(H305=I305,\"OK\",\"razlika\")","v":"OK"},186.62,{"$f":"ROUND(G305*$S$329,2)","v":34.18},220.8,{"$f":"F305","v":186.62},{"$f":"ROUND(G305*$R$329,2)","v":38.49},{"$f":"N305+O305","v":225.11},{"$f":"F305","v":186.62},{"$f":"ROUND(G305*$Q$329,2)","v":45.18},{"$f":"Q305+R305","v":231.8},186.62,{"$f":"ROUND(G305*$P$329,2)","v":48.53},{"$f":"T305+U305","v":235.15},{"$f":"F305","v":186.62},{"$f":"ROUND(G305*$O$329,2)","v":48.3},{"$f":"W305+X305","v":234.92000000000002},186.62,{"$f":"ROUND(G305*$N$329,2)","v":47.41},{"$f":"Z305+AA305","v":234.03},{"$f":"+Z305","v":186.62},{"$f":"ROUND(G305*$M$329,2)","v":43.86},{"$f":"AC305+AD305","v":230.48000000000002},0.92,220.05,{"$f":"I305","v":220.05},"OK",160.25,{"$f":"ROUND(I305-AF305*$L$326,2)","v":160.25},"OK",{"$f":"K305+L305","v":220.8},{"$f":"ROUND((K305+L305)-AF305*$K$326,2)","v":171.66},{"$f":"N305+O305","v":225.11},{"$f":"ROUND((N305+O305)-AF305*$J$326,2)","v":176.23},{"$f":"Q305+R305","v":231.8},{"$f":"ROUND((Q305+R305)-AF305*$I$326,2)","v":180.47},{"$f":"T305+U305","v":235.15},{"$f":"ROUND((T305+U305)-AF305*$H$326,2)","v":188.54},{"$f":"W305+X305","v":234.92000000000002},{"$f":"ROUND((W305+X305)-AF305*$G$326,2)","v":195.07},{"$f":"+Z305+AA305","v":234.03},{"$f":"ROUND((Z305+AA305)-AF305*$F$326,2)","v":197.55},{"$f":"+AC305+AD305","v":230.48000000000002},{"$f":"ROUND((AC305+AD305)-AF305*$E$326,2)","v":196.54},null,6.6899999999999977,4.2400000000000091,{"$f":"AS305-AQ305","v":3.3499999999999943},{"$f":"AT305-AR305","v":8.0699999999999932},{"$f":"AU305-AS305","v":-0.22999999999998977},{"$f":"AV305-AT305","v":6.5300000000000011},-0.89000000000001478,2.4800000000000182,-3.5499999999999829,-1.0100000000000193]
["SL23","10. SPTE na lesno biomaso (več kot 4.000 ur)",null,"srednja - nižja - od 1MW do vključno 5MW","SL23",140.81,31.46,172.27,{"$f":"F306+G306","v":172.27},{"$f":"IF(H306=I306,\"OK\",\"razlika\")","v":"OK"},140.81,{"$f":"ROUND(G306*$S$329,2)","v":32.159999999999997},172.97,{"$f":"F306","v":140.81},{"$f":"ROUND(G306*$R$329,2)","v":36.22},{"$f":"N306+O306","v":177.03},{"$f":"F306","v":140.81},{"$f":"ROUND(G306*$Q$329,2)","v":42.52},{"$f":"Q306+R306","v":183.33},140.81,{"$f":"ROUND(G306*$P$329,2)","v":45.67},{"$f":"T306+U306","v":186.48000000000002},140.81,{"$f":"ROUND(G306*$O$329,2)","v":45.45},{"$f":"W306+X306","v":186.26},140.81,{"$f":"ROUND(G306*$N$329,2)","v":44.61},185.42000000000002,140.81,{"$f":"ROUND(G306*$M$329,2)","v":41.27},{"$f":"AC306+AD306","v":182.08},0.94,"(ni ZO)","(ni ZO)","OK",111.17,{"$f":"ROUND(I306-AF306*$L$326,2)","v":111.17},"OK","(ni ZO)",{"$f":"ROUND((K306+L306)-AF306*$K$326,2)","v":122.76},"(ni ZO)",{"$f":"ROUND((N306+O306)-AF306*$J$326,2)","v":127.09},"(ni ZO)",{"$f":"ROUND((Q306+R306)-AF306*$I$326,2)","v":130.88999999999999},"(ni ZO)",{"$f":"ROUND((T306+U306)-AF306*$H$326,2)","v":138.86000000000001},"(ni ZO)",{"$f":"ROUND((W306+X306)-AF306*$G$326,2)","v":145.55000000000001},"(ni ZO)",{"$f":"ROUND((Z306+AA306)-AF306*$F$326,2)","v":148.15},"(ni ZO)",147.4,null,"(ni ZO)",3.7999999999999829,"(ni ZO)",7.9700000000000273,"(ni ZO)",6.6899999999999977,"(ni ZO)",2.5999999999999943,"(ni ZO)",-0.75]
["SL24","10. SPTE na lesno biomaso (več kot 4.000 ur)",null,"srednja - višja - nad 5MW do vključno 25MW","SL24",101.36,27.73,129.09,{"$f":"F307+G307","v":129.09},{"$f":"IF(H307=I307,\"OK\",\"razlika\")","v":"OK"},101.36,{"$f":"ROUND(G307*$S$329,2)","v":28.35},129.71,{"$f":"F307","v":101.36},{"$f":"ROUND(G307*$R$329,2)","v":31.93},{"$f":"N307+O307","v":133.29},{"$f":"F307","v":101.36},{"$f":"ROUND(G307*$Q$329,2)","v":37.479999999999997},{"$f":"Q307+R307","v":138.84},101.36,{"$f":"ROUND(G307*$P$329,2)","v":40.25},{"$f":"T307+U307","v":141.61000000000001},101.36,{"$f":"ROUND(G307*$O$329,2)","v":40.06},{"$f":"W307+X307","v":141.42000000000002},101.36,{"$f":"ROUND(G307*$N$329,2)","v":39.32},140.68,101.36,36.380000000000003,137.74,0.94,"(ni ZO)","(ni ZO)","OK",67.989999999999995,{"$f":"ROUND(I307-AF307*$L$326,2)","v":67.989999999999995},"OK","(ni ZO)",{"$f":"ROUND((K307+L307)-AF307*$K$326,2)","v":79.5},"(ni ZO)",{"$f":"ROUND((N307+O307)-AF307*$J$326,2)","v":83.35},"(ni ZO)",{"$f":"ROUND((Q307+R307)-AF307*$I$326,2)","v":86.4},"(ni ZO)",{"$f":"ROUND((T307+U307)-AF307*$H$326,2)","v":93.99},"(ni ZO)",{"$f":"ROUND((W307+X307)-AF307*$G$326,2)","v":100.71},"(ni ZO)",{"$f":"ROUND((Z307+AA307)-AF307*$F$326,2)","v":103.41},"(ni ZO)",103.06,null,"(ni ZO)",3.0500000000000114,"(ni ZO)",7.5899999999999892,"(ni ZO)",6.7199999999999989,"(ni ZO)",2.7000000000000028,"(ni ZO)",-0.34999999999999432]
["SL25","10. SPTE na lesno biomaso (več kot 4.000 ur)",null,"velika - nižja - nad 25MW do vključno 50MW","SL25",80.849999999999994,28.65,109.51,{"$f":"F308+G308","v":109.5},{"$f":"IF(H308=I308,\"OK\",\"razlika\")","v":"razlika"},80.849999999999994,{"$f":"ROUND(G308*$S$329,2)","v":29.29},110.13999999999999,{"$f":"F308","v":80.849999999999994},{"$f":"ROUND(G308*$R$329,2)","v":32.99},{"$f":"N308+O308","v":113.84},{"$f":"F308","v":80.849999999999994},{"$f":"ROUND(G308*$Q$329,2)","v":38.72},{"$f":"Q308+R308","v":119.57},80.849999999999994,{"$f":"ROUND(G308*$P$329,2)","v":41.59},{"$f":"T308+U308","v":122.44},80.849999999999994,{"$f":"ROUND(G308*$O$329,2)","v":41.39},{"$f":"W308+X308","v":122.24},80.849999999999994,{"$f":"ROUND(G308*$N$329,2)","v":40.630000000000003},121.47999999999999,80.849999999999994,37.590000000000003,118.44,0.97,"(ni ZO)","(ni ZO)","OK",46.46,{"$f":"ROUND(I308-AF308*$L$326,2)","v":46.45},"razlika","(ni ZO)",{"$f":"ROUND((K308+L308)-AF308*$K$326,2)","v":58.33},"(ni ZO)",{"$f":"ROUND((N308+O308)-AF308*$J$326,2)","v":62.3},"(ni ZO)",{"$f":"ROUND((Q308+R308)-AF308*$I$326,2)","v":65.45},"(ni ZO)",{"$f":"ROUND((T308+U308)-AF308*$H$326,2)","v":73.3},"(ni ZO)",{"$f":"ROUND((W308+X308)-AF308*$G$326,2)","v":80.23},"(ni ZO)",{"$f":"ROUND((Z308+AA308)-AF308*$F$326,2)","v":83.02},"(ni ZO)",82.66,"napačen seštevek RSEE v uredbi","(ni ZO)",3.1500000000000057,"(ni ZO)",7.8499999999999943,"(ni ZO)",6.9300000000000068,"(ni ZO)",2.789999999999992,"(ni ZO)",-0.35999999999999943]
["SL26","10. SPTE na lesno biomaso (več kot 4.000 ur)",null,"velika - višja - nad 50MW do 200MW","SL26","(indvid.)","(indvid.)","(indvid.)","(indvid.)","(indvid.)","(indvid.)","(indvid.)","(indvid.)","(indvid.)","(indvid.)","(indvid.)","(indvid.)","(indvid.)","(indvid.)","(indvid.)","(indvid.)","(indvid.)","(indvid.)","(indvid.)","(indvid.)","(indvid.)","(indvid.)","(indvid.)","(indvid.)","(indvid.)","(indvid.)",0.97,"(ni ZO)","(ni ZO)","OK","(indvid.)","(indvid.)","OK","(ni ZO)","(indvid.)","(ni ZO)","(indvid.)","(ni ZO)","(indvid.)","(ni ZO)","(indvid.)","(ni ZO)","(indvid.)","(ni ZO)","(indvid.)","(ni ZO)","(indvid.)",null,"(ni ZO; individ.)","(individ.)","(ni ZO; individ.)","(individ.)","(ni ZO; individ.)","(individ.)","(ni ZO; individ.)","(individ.)","(ni ZO; individ.)","(individ.)"]
["SF11","11. SPTE na fosilna goriva (do 4.000 ur)","11. SPTE na fosilna goriva (do 4.000 ur)","mikro - manjše od 50kW","SF11",174.07,59.64,233.71,{"$f":"F310+G310","v":233.70999999999998},{"$f":"IF(H310=I310,\"OK\",\"razlika\")","v":"OK"},174.07,{"$f":"ROUND(G310*$S$331+E342-E342*$S$331,2)","v":63.32},237.39,{"$f":"F310","v":174.07},{"$f":"ROUND(G310*$R$331+F342-F342*$R$331,2)","v":72.08},{"$f":"N310+O310","v":246.14999999999998},{"$f":"F310","v":174.07},{"$f":"ROUND(G310*$Q$331+G342-G342*$Q$331,2)","v":77.67},{"$f":"Q310+R310","v":251.74},174.07,{"$f":"ROUND(G310*$P$331+H342-H342*$P$331,2)","v":81.87},{"$f":"T310+U310","v":255.94},{"$f":"F310","v":174.07},{"$f":"ROUND(G310*$O$331+I342-I342*$O$331,2)","v":75.06},{"$f":"W310+X310","v":249.13},174.07,{"$f":"ROUND(G310*$N$331+J342-J342*$N$331,2)","v":64.52},{"$f":"+Z310+AA310","v":238.58999999999997},{"$f":"+Z310","v":174.07},{"$f":"ROUND(G310*$M$331+K342-K342*$M$331,2)","v":56.09},{"$f":"+AC310+AD310","v":230.16},0.85,233.71,{"$f":"I310","v":233.70999999999998},"OK",178.46,{"$f":"ROUND(I310-AF310*$L$326,2)","v":178.46},"OK",{"$f":"K310+L310","v":237.39},{"$f":"ROUND((K310+L310)-AF310*$K$326,2)","v":191.99},{"$f":"N310+O310","v":246.14999999999998},{"$f":"ROUND((N310+O310)-AF310*$J$326,2)","v":200.99},{"$f":"Q310+R310","v":251.74},{"$f":"ROUND((Q310+R310)-AF310*$I$326,2)","v":204.32},{"$f":"T310+U310","v":255.94},{"$f":"ROUND((T310+U310)-AF310*$H$326,2)","v":212.88},{"$f":"W310+X310","v":249.13},{"$f":"ROUND((W310+X310)-AF310*$G$326,2)","v":212.32},{"$f":"+Z310+AA310","v":238.58999999999997},{"$f":"ROUND((Z310+AA310)-AF310*$F$326,2)","v":204.89},{"$f":"+AC310+AD310","v":230.16},{"$f":"ROUND((AC310+AD310)-AF310*$E$326,2)","v":198.8},null,5.5900000000000318,3.3299999999999841,{"$f":"AS310-AQ310","v":4.1999999999999886},{"$f":"AT310-AR310","v":8.5600000000000023},{"$f":"AU310-AS310","v":-6.8100000000000023},{"$f":"AV310-AT310","v":-0.56000000000000227},-10.54000000000002,-7.4300000000000068,-8.4299999999999784,-6.089999999999975]
["SF12","11. SPTE na fosilna goriva (do 4.000 ur)",null,"mala - manjše od 1MW","SF12",92.94,59.39,152.33000000000001,152.32999999999998,"OK",92.94,63.31,156.25,{"$f":"F311","v":92.94},72.650000000000006,165.59,92.94,78.599999999999994,171.54,92.94,83.09,176.03,92.94,75.819999999999993,168.76,92.94,64.59,{"$f":"+Z311+AA311","v":157.53},92.94,{"$f":"ROUND(G311*$M$331+K343-K343*$M$331,2)","v":55.61},{"$f":"+AC311+AD311","v":148.55000000000001},0.88,152.33000000000001,{"$f":"I311","v":152.32999999999998},"OK",95.13,95.13,"OK",{"$f":"K311+L311","v":156.25},109.25,{"$f":"N311+O311","v":165.59},118.84,{"$f":"Q311+R311","v":171.54},122.44,{"$f":"T311+U311","v":176.03},131.44999999999999,{"$f":"W311+X311","v":168.76},130.65,{"$f":"+Z311+AA311","v":157.53},122.64,148.55000000000001,116.09,null,5.9499999999999886,3.5999999999999943,4.4900000000000091,9.0099999999999909,-7.2700000000000102,-0.79999999999998295,-11.22999999999999,-8.0100000000000051,-8.9799999999999898,-6.5499999999999972]
["SF13","11. SPTE na fosilna goriva (do 4.000 ur)",null,"srednja - nižja - od 1MW do vključno 5MW","SF13",73.099999999999994,44.69,117.79,117.78999999999999,"OK",73.099999999999994,48.8,121.89999999999999,73.099999999999994,58.6,131.69999999999999,73.099999999999994,64.849999999999994,137.94999999999999,73.099999999999994,69.55,142.64999999999998,73.099999999999994,61.93,135.03,73.099999999999994,50.14,123.24,73.099999999999994,40.729999999999997,113.82999999999998,0.93,"(ni ZO)","(ni ZO)","OK",57.34,57.34,"OK","(ni ZO)",72.23,"(ni ZO)",82.29,"(ni ZO)",86.07,"(ni ZO)",95.54,"(ni ZO)",94.75,"(ni ZO)",86.37,"(ni ZO)",79.52,null,"(ni ZO)",3.7799999999999869,"(ni ZO)",9.4700000000000131,"(ni ZO)",-0.79000000000000625,"(ni ZO)",-8.3799999999999955,"(ni ZO)",-6.8500000000000085]
["SF14","11. SPTE na fosilna goriva (do 4.000 ur)",null,"srednja - višja - nad 5MW do vključno 25MW","SF14",64,49.86,113.86,113.86,"OK",64,54.56,118.56,64,65.77,129.76999999999998,64,72.92,136.92000000000002,64,78.3,142.30000000000001,64,69.58,133.57999999999998,64,56.1,120.1,64,45.33,109.33,0.93,"(ni ZO)","(ni ZO)","OK",53.41,53.41,"OK","(ni ZO)",68.89,"(ni ZO)",80.36,"(ni ZO)",85.04,"(ni ZO)",95.19,"(ni ZO)",93.3,"(ni ZO)",83.23,"(ni ZO)",75.02,null,"(ni ZO)",4.6800000000000068,"(ni ZO)",10.149999999999991,"(ni ZO)",-1.8900000000000006,"(ni ZO)",-10.069999999999993,"(ni ZO)",-8.210000000000008]
["SF15","11. SPTE na fosilna goriva (do 4.000 ur)",null,"velika - nižja - nad 25MW do vključno 50MW","SF15",72.5,44.9,117.4,117.4,"OK",72.5,49.23,121.72999999999999,72.5,59.54,132.04,72.5,66.12,138.62,72.5,71.06,143.56,72.5,63.04,135.54,72.5,50.64,123.14,72.5,40.729999999999997,113.22999999999999,0.96,"(ni ZO)","(ni ZO)","OK",55,55,"OK","(ni ZO)",70.459999999999994,"(ni ZO)",81.040000000000006,"(ni ZO)",85.06,"(ni ZO)",94.93,"(ni ZO)",93.96,"(ni ZO)",85.08,"(ni ZO)",77.819999999999993,null,"(ni ZO)",4.019999999999996,"(ni ZO)",9.8700000000000045,"(ni ZO)",-0.97000000000001307,"(ni ZO)",-8.8799999999999955,"(ni ZO)",-7.2600000000000051]
["SF16","11. SPTE na fosilna goriva (do 4.000 ur)",null,"velika - višja - nad 50MW do 200MW","SF16",66.2,40.94,107.13,107.14,"razlika",66.2,44.96,111.16,66.2,54.53,120.73,66.2,60.63,126.83000000000001,66.2,65.22,131.42000000000002,66.2,57.78,123.98,66.2,46.27,112.47,66.2,37.07,103.27000000000001,0.96,"(ni ZO)","(ni ZO)","OK",44.73,44.74,"razlika","(ni ZO)",59.89,"(ni ZO)",69.73,"(ni ZO)",73.27,"(ni ZO)",82.79,"(ni ZO)",82.4,"(ni ZO)",74.41,"(ni ZO)",67.86,"napačen seštevek RSEE v uredbi","(ni ZO)",3.539999999999992,"(ni ZO)",9.5200000000000102,"(ni ZO)",-0.39000000000000057,"(ni ZO)",-7.9900000000000091,"(ni ZO)",-6.5499999999999972]
["SF21","11. SPTE na fosilna goriva (več kot 4.000 ur)","11. SPTE na fosilna goriva (več kot 4.000 ur)","mikro - manjše od 50kW","SF21",116.23,59.64,175.86,{"$f":"F316+G316","v":175.87},{"$f":"IF(H316=I316,\"OK\",\"razlika\")","v":"razlika"},116.23,{"$f":"ROUND(G316*$S$331+E342-E342*$S$331,2)","v":63.32},179.55,116.23,{"$f":"ROUND(G316*$R$331+F342-F342*$R$331,2)","v":72.08},188.31,116.23,{"$f":"ROUND(G316*$Q$331+G342-G342*$Q$331,2)","v":77.67},193.9,116.23,{"$f":"ROUND(G316*$P$331+H342-H342*$P$331,2)","v":81.87},198.10000000000002,116.23,{"$f":"ROUND(G316*$O$331+I342-I342*$O$331,2)","v":75.06},191.29000000000002,116.23,{"$f":"ROUND(G316*$N$331+J342-J342*$N$331,2)","v":64.52},180.75,116.23,{"$f":"ROUND(G316*$M$331+K342-K342*$M$331,2)","v":56.09},172.32,0.9,175.86,{"$f":"I316","v":175.87},"razlika",117.36,117.37,"razlika",{"$f":"K316+L316","v":179.55},131.47999999999999,{"$f":"N316+O316","v":188.31},140.49,{"$f":"Q316+R316","v":193.9},143.69,{"$f":"T316+U316","v":198.10000000000002},152.51,{"$f":"W316+X316","v":191.29000000000002},152.31,{"$f":"+Z316+AA316","v":180.75},145.07,{"$f":"+AC316+AD316","v":172.32},{"$f":"ROUND((AC316+AD316)-AF316*$E$326,2)","v":139.12},"napačen seštevek RSEE v uredbi",5.5900000000000034,3.1999999999999886,{"$f":"AS316-AQ316","v":4.2000000000000171},8.8199999999999932,{"$f":"AU316-AS316","v":-6.8100000000000023},-0.19999999999998863,-10.54000000000002,-7.2400000000000091,-8.4300000000000068,-5.9499999999999886]
["SF22","11. SPTE na fosilna goriva (več kot 4.000 ur)",null,"mala - manjše od 1MW","SF22",62.41,59.39,121.81,121.8,"razlika",62.41,63.31,125.72,62.41,72.650000000000006,135.06,62.41,78.599999999999994,141.01,62.41,83.09,145.5,62.41,75.819999999999993,138.22999999999999,62.41,64.59,127,62.41,{"$f":"ROUND(G317*$M$331+K343-K343*$M$331,2)","v":55.61},118.02,0.92,121.81,{"$f":"I317","v":121.8},"razlika",62.01,62,"razlika",{"$f":"K317+L317","v":125.72},76.58,{"$f":"N317+O317","v":135.06},86.18,{"$f":"Q317+R317","v":141.01},89.68,{"$f":"T317+U317","v":145.5},98.89,{"$f":"W317+X317","v":138.22999999999999},98.38,{"$f":"+Z317+AA317","v":127},90.52,118.02,84.08,"napačen seštevek RSEE v uredbi",5.9499999999999886,3.5,4.4900000000000091,9.2099999999999937,-7.2700000000000102,-0.51000000000000512,-11.22999999999999,-7.8599999999999994,-8.980000000000004,-6.4399999999999977]
["SF23","11. SPTE na fosilna goriva (več kot 4.000 ur)",null,"srednja - nižja - od 1MW do vključno 5MW","SF23",49.43,44.69,94.11,94.12,"razlika",49.43,48.8,98.22999999999999,49.43,58.6,108.03,49.43,64.849999999999994,114.28,49.43,69.55,118.97999999999999,49.43,61.93,111.36,49.43,50.14,99.57,49.43,40.729999999999997,90.16,0.94,"(ni ZO)","(ni ZO)","OK",33.01,33.020000000000003,"razlika","(ni ZO)",48.02,"(ni ZO)",58.09,"(ni ZO)",61.84,"(ni ZO)",71.36,"(ni ZO)",70.650000000000006,"(ni ZO)",62.3,"(ni ZO)",55.48,"napačen seštevek RSEE v uredbi","(ni ZO)",3.75,"(ni ZO)",9.519999999999996,"(ni ZO)",-0.70999999999999375,"(ni ZO)",-8.3500000000000085,"(ni ZO)",-6.82]
["SF24","11. SPTE na fosilna goriva (več kot 4.000 ur)",null,"srednja - višja - nad 5MW do vključno 25MW","SF24",43.27,49.86,93.13,93.13,"OK",43.27,54.56,97.830000000000013,43.27,65.77,109.03999999999999,43.27,72.92,116.19,43.27,78.3,121.57,43.27,69.58,112.85,43.27,56.1,99.37,43.27,45.33,88.6,0.94,"(ni ZO)","(ni ZO)","OK",32.03,32.03,"OK","(ni ZO)",47.62,"(ni ZO)",59.1,"(ni ZO)",63.75,"(ni ZO)",73.95,"(ni ZO)",72.14,"(ni ZO)",62.1,"(ni ZO)",53.92,null,"(ni ZO)",4.6499999999999986,"(ni ZO)",10.200000000000003,"(ni ZO)",-1.8100000000000023,"(ni ZO)",-10.039999999999999,"(ni ZO)",-8.18]
["SF25","11. SPTE na fosilna goriva (več kot 4.000 ur)",null,"velika - nižja - nad 25MW do vključno 50MW","SF25",47.59,44.9,92.49,92.490000000000009,"OK",47.59,49.23,96.82,47.59,59.54,107.13,47.59,66.12,113.71000000000001,47.59,71.06,118.65,47.59,63.04,110.63,47.59,50.64,98.23,47.59,40.729999999999997,88.32,0.97,"(ni ZO)","(ni ZO)","OK",29.44,29.44,"OK","(ni ZO)",45.01,"(ni ZO)",55.59,"(ni ZO)",59.59,"(ni ZO)",69.510000000000005,"(ni ZO)",68.62,"(ni ZO)",59.77,"(ni ZO)",52.54,null,"(ni ZO)",4,"(ni ZO)",9.9200000000000017,"(ni ZO)",-0.89000000000000057,"(ni ZO)",-8.8500000000000014,"(ni ZO)",-7.230000000000004]
["SF26","11. SPTE na fosilna goriva (več kot 4.000 ur)",null,"velika - višja - nad 50MW do 200MW","SF26",43.22,40.94,84.15,84.16,"razlika",43.22,44.96,88.18,43.22,54.53,97.75,43.22,60.63,103.85,43.22,65.22,108.44,43.22,57.78,101,43.22,46.27,89.490000000000009,43.22,37.07,80.289999999999992,0.97,"(ni ZO)","(ni ZO)","OK",21.1,21.11,"razlika","(ni ZO)",36.369999999999997,"(ni ZO)",46.21,"(ni ZO)",49.73,"(ni ZO)",59.3,"(ni ZO)",58.99,"(ni ZO)",51.03,"(ni ZO)",44.51,"napačen seštevek RSEE v uredbi","(ni ZO)",3.519999999999996,"(ni ZO)",9.57,"(ni ZO)",-0.30999999999999517,"(ni ZO)",-7.9600000000000009,"(ni ZO)",-6.5200000000000031]
[]
[null,null,null,"= formula v celici"]
[]
[null,null,null,null,2016,2015,2014,2013,2012,2011,2010,2009,"Indeks cene 2016","Indeks cene 2015","Indeks cene 2014","Indeks cene 2013","Indeks cene 2012","Indeks cene 2011","Indeks cene 2010","SOSEŽIG DO 5%",null,null,null,null,null,null,null,null,"Izhodišča za izračune:"]
[null,null,"EE","€/MWh",36.89,39.65,43.31,50.66,55.79,53.13,53.41,65,null,null,null,null,null,null,null,2010,"OP=SDRS",null,null,null,null,null,null,null,"- izhaja se iz ločenih NDRS in SDRS 2009 kot tabelirani v uredbi"]
[null,null,"PREMOG","EUR/GJ",2.54,2.54,2.54,2.61,2.65,2.83,2.87,3.5,null,null,null,null,null,null,null,{"$f":"K327*3.6","v":10.332000000000001},{"$f":"ROUND(((T328-T327)/0.3),2)","v":35.520000000000003},null,null,null,null,null,null,null,"- če je OP ali ZO za 2009 drugače določena v Uredbi, se za 2009 upošteva to"]
[null,null,"LB sosežig","EUR/GJ",{"$f":"ROUND(L328*M329,2)","v":7.48},{"$f":"ROUND(L328*N329,2)","v":8.08},{"$f":"ROUND(L328*O329,2)","v":8.23},{"$f":"ROUND(L328*P329,2)","v":8.27},{"$f":"ROUND(L328*Q329,2)","v":7.7},{"$f":"ROUND(L328*R329,2)","v":6.56},{"$f":"ROUND(L328*S329,2)","v":5.83},5.7,null,null,null,null,null,null,null,{"$f":"K328*3.6","v":20.988},null,null,null,null,null,null,null,null,"- indekse (koeficiente dinamike) za usklajevanje SDRS se uporablja zaokrožene na 5 decimalk"]
[null,null,"lesna biomasa - Clb","€/t",52.87,57.15,58.22,58.5,54.47,46.4,41.2,40.299999999999997,{"$f":"ROUND(E329/L329,5)","v":1.3119099999999999},{"$f":"ROUND(F329/L329,5)","v":1.41811},{"$f":"ROUND(G329/L329,5)","v":1.4446699999999999},{"$f":"ROUND(H329/L329,5)","v":1.4516100000000001},{"$f":"ROUND(I329/L329,5)","v":1.35161},{"$f":"ROUND(J329/L329,5)","v":1.1513599999999999},{"$f":"ROUND(K329/L329,5)","v":1.02233},2011,"OP=SDRS",null,null,null,null,null,null,null,"- pri računanju novih NDRS ali SDRS se jih zaokroži na 2 decimalni mesti in zaokrožene uporablja za nadaljnje izračune"]
[null,null,"koruzna silaža - Cs","EUR/t",23.34,31.33,28,32,24,24,24,23.59,{"$f":"ROUND(E330/L330,5)","v":0.98939999999999995},{"$f":"ROUND(F330/L330,5)","v":1.3281099999999999},{"$f":"ROUND(G330/L330,5)","v":1.1869400000000001},{"$f":"ROUND(H330/L330,5)","v":1.3565100000000001},{"$f":"ROUND(I330/L330,5)","v":1.01738},{"$f":"ROUND(J330/L330,5)","v":1.01738},{"$f":"ROUND(K330/L330,5)","v":1.01738},{"$f":"J327*3.6","v":10.188000000000001},{"$f":"ROUND(((T331-T330)/0.3),2)","v":44.76},null,null,null,null,null,null,null,"- uporablja se Faktorje B, kot določeni v Prilogi III, ne glede na implicitno uporabo drugačnih"]
[null,null,"zemeljski plin - Cb","€/Sm3",0.21310000000000001,0.27700000000000002,0.35699999999999998,0.40870000000000001,0.37680000000000002,0.33439999999999998,0.26790000000000003,0.24,{"$f":"ROUND(E331/L331,5)","v":0.88792000000000004},{"$f":"ROUND(F331/L331,5)","v":1.1541699999999999},1.4875,1.70292,{"$f":"ROUND(I331/L331,5)","v":1.57},{"$f":"ROUND(J331/L331,5)","v":1.39333},{"$f":"ROUND(K331/L331,5)","v":1.11625},{"$f":"J328*3.6","v":23.616}]
[null,null,null,null,null,null,null,null,null,null,null,null,null,null,null,null,null,null,null,2012,"OP=SDRS"]
[null,null,null,null,null,null,null,null,null,null,null,null,null,null,null,null,null,null,null,{"$f":"I327*3.6","v":9.5399999999999991},{"$f":"ROUND(((T334-T333)/0.3),2)","v":60.6}]
[null,null,null,null,null,null,null,"Cena plina 2015: od 1.1.2016 = 0,1142",null,null,null,null,null,null,null,null,null,null,null,{"$f":"I328*3.6","v":27.720000000000002}]
[null,null,"Korekcijski faktor N za določanje SDRS za bioplin na biomaso",null,"N",null,null,"Cena plina 2015: od 1.1.2015 = 0,2770",null,null,null,null,null,null,null,null,null,null,null,2013,"OP=SDRS"]
[null,null,null,"mikro - manjše od 50kW",11.9,null,null,"Cena plina 2014: od 1.1.2014 do 30.6.2014 = 0,3042; od 1.7.2014 do 31.12.2014 = 0,3570",null,null,null,null,null,null,null,null,null,null,null,{"$f":"H327*3.6","v":9.395999999999999},{"$f":"ROUND(((T337-T336)/0.3),2)","v":67.92}]
[null,null,null,"mala - manjše od 1MW",11.9,null,null,"Cena plina 2010: od 1.1.2010 do 30.6.2010 = 0,2271; od 1.7.2010 do 31.12.2010 = 0,2679",null,null,null,null,null,null,null,null,null,null,null,{"$f":"H328*3.6","v":29.771999999999998}]
[null,null,null,"srednja - od 1MW do vključno 10MW ",7.14,null,null,"Cena plina 2011: od 1.1.2011 do 30.6.2011 = 0,2868; od 1.7.2011 do 31.12.2011 = 0,3344",null,null,null,null,null,null,null,null,null,null,null,2014,"OP=SDRS"]
[null,null,null,null,null,null,null,"Cena plina 2012: od 1.1.2012 do 31.12.2012 = 0,3768",null,null,null,null,null,null,null,null,null,null,null,{"$f":"G327*3.6","v":9.1440000000000001},{"$f":"ROUND(((T340-T339)/0.3),2)","v":68.28}]
[null,null,null,null,null,null,null,"Cena plina 2013: od 1.1.2013 do 31.12.2013 = 0,4087",null,null,null,null,null,null,null,null,null,null,null,{"$f":"G328*3.6","v":29.628000000000004}]
[null,null,"Korekcijski faktor N za določanje SDRS za zemeljski plin",null,"N(0)-2010","N(0)-2011","N(0)-2012","N(0)-2013","N(0)-2014","N(0)-2015","N(0)-2016",null,null,null,null,null,null,null,null,2015,"OP=SDRS"]
[null,null,null,"mikro - manjše od 50kW",28.01,28.01,28.01,28.01,28.01,28.01,28.01,null,null,null,null,null,null,null,null,{"$f":"F327*3.6","v":9.1440000000000001},{"$f":"ROUND(((T343-T342)/0.3),2)","v":66.48}]
[null,null,null,"mala - manjše od 1MW",25.68,25.68,25.68,25.68,25.68,25.68,25.68,null,null,null,null,null,null,null,null,{"$f":"F328*3.6","v":29.088000000000001}]
[null,null,null,"srednja - nižja - od 1MW do vključno 5MW",9.33,9.33,9.33,9.33,9.33,9.33,9.33,null,null,null,null,null,null,null,null,2016,"OP=SDRS"]
[null,null,null,"srednja - višja - nad 5MW do vključno 25MW",9.4,9.4,9.4,9.4,9.4,9.4,9.4,null,null,null,null,null,null,null,null,{"$f":"E327*3.6","v":9.1440000000000001},{"$f":"ROUND(((T346-T345)/0.3),2)","v":59.28}]
[null,null,null,"velika - nižja - nad 25MW do vključno 50MW",7.68,7.68,7.68,7.68,7.68,7.68,7.68,null,null,null,null,null,null,null,null,{"$f":"E328*3.6","v":26.928000000000001}]
[null,null,null,"velika - višja - nad 50MW do 200MW",6.4,6.4,6.4,6.4,6.4,6.4,6.4]

{"sheet":"OPOMBE","index":3,"n_rows":34,"n_cols":3,"rows_kept":34,"cut":false,"hidden":true,"merged":[]}
[]
["Upoštevani parametri AGEN-RS za 2012"]
[]
["elektrika",55.79,"EUR/MWh"]
["plin",0.37680000000000002,"EUR/Sm3"]
["lesna biomasa",54.47,"EUR/t"]
["koruzna silaža",24,"EUR/t"]
["premog",2.65,"EUR/GJ"]
[]
["v28nov11"]
["popravljeni SDRS 2012 za skupino SF2"]
[]
["v23dec11"]
["dodani H1 in H2 za 2012 za PV (RSEE) glede na spremembo uredbe OVE"]
[]
["v20nov12"]
["Narejena verzija za podpore 2013 - manjkajo še PV instalirane v 2013"]
["Upoštevani parametri AGEN"]
["EE","€/MWh",50.66]
["PREMOG","EUR/GJ",2.61]
["LB sosežig","EUR/GJ",8.27]
["lesna biomasa - Clb","€/t",58.5]
["koruzna silaža - Cs","EUR/t",24]
["zemeljski plin - Cb","€/Sm3",0.40870000000000001]
[]
["v3jan13"]
[]
["cena koruzne silaže popravljena iz 24 na 32 glede na objavo AGEN-RS z dne 31.12.2012"]
[]
["v18jul14"]
["korigirana cena plina za drugo polovico 2014 (1.7.-31.12.)"]
[]
["v2dec14"]
["popravljena formula pri BP13 SDRS"]

{"sheet":"Podpore 2014","index":4,"n_rows":348,"n_cols":13,"rows_kept":348,"cut":false,"hidden":true,"merged":[[323,1,328,1],[329,1,334,1],[317,1,322,1],[267,1,270,1],[271,1,274,1],[275,1,278,1],[279,1,282,1],[283,1,286,1],[287,1,290,1],[291,1,294,1],[295,1,298,1],[299,1,304,1],[305,1,310,1],[311,1,316,1],[263,1,266,1],[219,1,222,1],[223,1,226,1],[227,1,230,1],[231,1,234,1],[235,1,238,1],[239,1,242,1],[243,1,246,1],[247,1,250,1],[251,1,254,1],[255,1,258,1],[259,1,262,1],[215,1,218,1],[171,1,174,1],[175,1,178,1],[179,1,182,1],[183,1,186,1],[187,1,190,1],[191,1,194,1],[195,1,198,1],[199,1,202,1],[203,1,206,1],[207,1,210,1],[211,1,214,1],[167,1,170,1],[123,1,126,1],[127,1,130,1],[131,1,134,1],[135,1,138,1],[139,1,142,1],[143,1,146,1],[147,1,150,1],[151,1,154,1],[155,1,158,1],[159,1,162,1],[163,1,166,1],[119,1,122,1],[75,1,78,1],[79,1,82,1],[83,1,86,1],[87,1,90,1],[91,1,94,1],[95,1,98,1],[99,1,102,1],[103,1,106,1],[107,1,110,1],[111,1,114,1],[115,1,118,1],[71,1,74,1],[27,1,30,1],[31,1,34,1],[35,1,38,1],[39,1,42,1],[43,1,46,1],[47,1,50,1],[51,1,54,1],[55,1,58,1],[59,1,62,1],[63,1,66,1],[67,1,70,1],[23,1,26,1],[0,0,0,9],[3,1,6,1],[7,1,10,1],[11,1,14,1],[15,1,18,1],[19,1,22,1]]}
["VIŠINE PODPOR 2014"]
[]
[null,null,null,"KODA","NDRS 2014","SDRS 2014","Skupni 2014","Faktor B po Prilogi III","Cena ZO 2014","Višina OP 2014",null,"ZO2014 - ZO2013","OP2014 - OP2013"]
["HE01","1. Hidroelektrarne","mikro - manjše od 50kW","HE01",105.47,0,105.47,0.86,105.47,68.22,null,0,6.32]
["HE02",null,"mala - manjše od 1MW","HE02",92.61,0,92.61,0.86,92.61,55.36,null,0,6.32]
["HE03",null,"srednja - od 1MW do vključno 10MW ","HE03",82.34,0,82.34,0.9,82.34,43.36,null,0,6.6099999999999994]
["HE04",null,"velika - nad 10MW do vključno 125MW","HE04",76.569999999999993,0,76.569999999999993,0.9,"(ni ZO)",37.590000000000003,null,"(ni ZO)",6.610000000000003]
["VE01","2. Vetrne elektrarne","mikro - manjše od 50kW","VE01",95.38,0,95.38,0.8,95.38,60.73,null,0,5.8799999999999955]
["VE02",null,"mala - manjše od 1MW","VE02",95.38,0,95.38,0.8,95.38,60.73,null,0,5.8799999999999955]
["VE03",null,"srednja - od 1MW do vključno 10MW ","VE03",95.38,0,95.38,0.8,95.38,60.73,null,0,5.8799999999999955]
["VE04",null,"velika - nad 10MW do vključno 125MW","VE04",86.74,0,86.74,0.86,"(ni ZO)",49.49,null,"(ni ZO)",6.32]
["SE11-2009","3.1 Sončne elektrarne - na stavbah 2009","mikro - manjše od 50kW","SE11",415.46,0,415.46,0.88,415.46,377.35,null,0,6.4700000000000273]
["SE12-2009",null,"mala - manjše od 1MW","SE12",380.02,0,380.02,0.88,380.02,341.91,null,0,6.4700000000000273]
["SE13-2009",null,"srednja - od 1MW do vključno 10MW ","SE13",315.36,0,315.36,0.91,315.36,275.95,null,0,6.6899999999999977]
["SE14-2009",null,"velika - nad 10MW do vključno 125MW","SE14",280.70999999999998,0,280.70999999999998,1,"(ni ZO)",237.4,null,"(ni ZO)",7.3499999999999943]
[null,"3.1. INT Sončne elektrarne - integrirane 2009","mikro - manjše od 50kW",null,477.78,0,477.78,0.88,477.78,439.67,null,0,6.4700000000000273]
[null,null,"mala - manjše od 1MW",null,437.02,0,437.02,0.88,437.02,398.91,null,0,6.4700000000000273]
[null,null,"srednja - od 1MW do vključno 10MW ",null,362.66,0,362.66,0.91,362.66,323.25,null,0,6.6899999999999977]
[null,null,"velika - nad 10MW do vključno 125MW",null,322.82,0,322.82,1,"(ni ZO)",279.51,null,"(ni ZO)",7.3499999999999659]
["SE21-2009","3.2 Sončne elektrarne - samostojni objekti 2009","mikro - manjše od 50kW","SE21",390.42,0,390.42,0.88,390.42,352.31,null,0,6.4700000000000273]
["SE22-2009",null,"mala - manjše od 1MW","SE22",359.71,0,359.71,0.88,359.71,321.60000000000002,null,0,6.4700000000000273]
["SE23-2009",null,"srednja - od 1MW do vključno 10MW ","SE23",289.98,0,289.98,0.91,289.98,250.57,null,0,6.6899999999999977]
["SE24-2009",null,"velika - nad 10MW do vključno 125MW","SE24",269.22000000000003,0,269.22000000000003,1,"(ni ZO)",225.91,null,"(ni ZO)",7.3499999999999943]
["SE11-2010","3.1 Sončne elektrarne - na stavbah 2010","mikro - manjše od 50kW","SE11",386.38,0,386.38,0.88,386.38,348.27,null,0,6.4699999999999704]
["SE12-2010",null,"mala - manjše od 1MW","SE12",353.42,0,353.42,0.88,353.42,315.31,null,0,6.4700000000000273]
["SE13-2010",null,"srednja - od 1MW do vključno 10MW ","SE13",293.27999999999997,0,293.27999999999997,0.91,293.27999999999997,253.87,null,0,6.6899999999999977]
["SE14-2010",null,"velika - nad 10MW do vključno 125MW","SE14",261.06,0,261.06,1,"(ni ZO)",217.75,null,"(ni ZO)",7.3499999999999943]
[null,"3.1 INT Sončne elektrarne - integrirane 2010","mikro - manjše od 50kW",null,444.34,0,444.34,0.88,444.34,406.23,null,0,6.4700000000000273]
[null,null,"mala - manjše od 1MW",null,406.43,0,406.43,0.88,406.43,368.32,null,0,6.4699999999999704]
[null,null,"srednja - od 1MW do vključno 10MW ",null,337.27,0,337.27,0.91,337.27,297.86,null,0,6.6899999999999977]
[null,null,"velika - nad 10MW do vključno 125MW",null,300.22000000000003,0,300.22000000000003,1,"(ni ZO)",256.91000000000003,null,"(ni ZO)",7.3500000000000227]
["SE21-2010","3.2 Sončne elektrarne - samostojni objekti 2010","mikro - manjše od 50kW","SE21",363.09,0,363.09,0.88,363.09,324.98,null,0,6.4700000000000273]
["SE22-2010",null,"mala - manjše od 1MW","SE22",334.53,0,334.53,0.88,334.53,296.42,null,0,6.4700000000000273]
["SE23-2010",null,"srednja - od 1MW do vključno 10MW ","SE23",269.68,0,269.68,0.91,269.68,230.27,null,0,6.6899999999999977]
["SE24-2010",null,"velika - nad 10MW do vključno 125MW","SE24",250.37,0,250.37,1,"(ni ZO)",207.06,null,"(ni ZO)",7.3499999999999943]
["SE11-2011","3.1 Sončne elektrarne - na stavbah 2011","mikro - manjše od 50kW","SE11",332.37,0,332.37,0.88,332.37,294.26,null,0,6.4699999999999704]
["SE12-2011",null,"mala - manjše od 1MW","SE12",304.02,0,304.02,0.88,304.02,265.91000000000003,null,0,6.4700000000000273]
["SE13-2011",null,"srednja - od 1MW do vključno 10MW ","SE13",252.29,0,252.29,0.91,252.29,212.88,null,0,6.6899999999999977]
["SE14-2011",null,"velika - nad 10MW do vključno 125MW","SE14",224.57,0,224.57,1,"(ni ZO)",181.26,null,"(ni ZO)",7.3499999999999943]
[null,"3.1 INT Sončne elektrarne - integrirane 2011","mikro - manjše od 50kW",null,382.23,0,382.23,0.88,382.23,344.12,null,0,6.4700000000000273]
[null,null,"mala - manjše od 1MW",null,349.62,0,349.62,0.88,349.62,311.51,null,0,6.4699999999999704]
[null,null,"srednja - od 1MW do vključno 10MW ",null,290.13,0,290.13,0.91,290.13,250.72,null,0,6.6899999999999977]
[null,null,"velika - nad 10MW do vključno 125MW",null,258.26,0,258.26,1,"(ni ZO)",214.95,null,"(ni ZO)",7.3499999999999943]
["SE21-2011","3.2 Sončne elektrarne - samostojni objekti 2011","mikro - manjše od 50kW","SE21",312.33999999999997,0,312.33999999999997,0.88,312.33999999999997,274.23,null,0,6.4700000000000273]
["SE22-2011",null,"mala - manjše od 1MW","SE22",287.77,0,287.77,0.88,287.77,249.66,null,0,6.4699999999999989]
["SE23-2011",null,"srednja - od 1MW do vključno 10MW ","SE23",231.98,0,231.98,0.91,231.98,192.57,null,0,6.6899999999999977]
["SE24-2011",null,"velika - nad 10MW do vključno 125MW","SE24",215.38,0,215.38,1,"(ni ZO)",172.07,null,"(ni ZO)",7.3499999999999943]
["SE11-2012H1","3.1 Sončne elektrarne - na stavbah 2012 H1","mikro - manjše od 50kW","SE11",290.82,0,290.82,0.88,290.82,252.71,null,0,6.4699999999999989]
["SE12-2012H1",null,"mala - manjše od 1MW","SE12",266.01,0,266.01,0.88,266.01,227.9,null,0,6.4699999999999989]
["SE13-2012H1",null,"srednja - od 1MW do vključno 10MW ","SE13",220.75,0,220.75,0.91,220.75,181.34,null,0,6.6899999999999977]
["SE14-2012H1",null,"velika - nad 10MW do vključno 125MW","SE14",196.5,0,196.5,1,"(ni ZO)",153.19,null,"(ni ZO)",7.3499999999999943]
["SE11-2012H2","3.1 Sončne elektrarne - na stavbah 2012 H2","mikro - manjše od 50kW","SE11",197.55,0,197.55,0.88,197.55,159.44,null,0,6.4699999999999989]
["SE12-2012H2",null,"mala - manjše od 1MW","SE12",180.7,0,180.7,0.88,180.7,142.59,null,0,6.4699999999999989]
["SE13-2012H2",null,"srednja - od 1MW do vključno 10MW ","SE13",149.94999999999999,0,149.94999999999999,0.91,149.94999999999999,110.54,null,0,6.6900000000000119]
["SE14-2012H2",null,"velika - nad 10MW do vključno 125MW","SE14",133.47999999999999,0,133.47999999999999,1,"(ni ZO)",90.17,null,"(ni ZO)",7.3500000000000085]
["SE21-2012H1","3.2 Sončne elektrarne - ostale 2012 H1","mikro - manjše od 50kW","SE21",273.29000000000002,0,273.29000000000002,0.88,273.29000000000002,235.18,null,0,6.4699999999999989]
["SE22-2012H1",null,"mala - manjše od 1MW","SE22",251.8,0,251.8,0.88,251.8,213.69,null,0,6.4699999999999989]
["SE23-2012H1",null,"srednja - od 1MW do vključno 10MW ","SE23",202.99,0,202.99,0.91,202.99,163.58000000000001,null,0,6.6900000000000261]
["SE24-2012H1",null,"velika - nad 10MW do vključno 125MW","SE24",188.45,0,188.45,1,"(ni ZO)",145.13999999999999,null,"(ni ZO)",7.3499999999999943]
["SE21-2012H2","3.2 Sončne elektrarne - ostale 2012 H2","mikro - manjše od 50kW","SE21",185.64,0,185.64,0.88,185.64,147.53,null,0,6.4699999999999989]
["SE22-2012H2",null,"mala - manjše od 1MW","SE22",171.04,0,171.04,0.88,171.04,132.93,null,0,6.4700000000000131]
["SE23-2012H2",null,"srednja - od 1MW do vključno 10MW ","SE23",137.88999999999999,0,137.88999999999999,0.91,137.88999999999999,98.48,null,0,6.6899999999999977]
["SE24-2012H2",null,"velika - nad 10MW do vključno 125MW","SE24",128.01,0,128.01,1,"(ni ZO)",84.7,null,"(ni ZO)",7.3500000000000085]
["SE11-2012dec",{"$f":"CONCATENATE(\"3.1 Sončne elektrarne - na stavbah\",\" \",RIGHT(A64,7))","v":"3.1 Sončne elektrarne - na stavbah 2012dec"},"mikro - manjše od 50kW","SE11",150,0,150,0.88,150,111.89,null,0,6.4699999999999989]
["SE12-2012dec",null,"mala - manjše od 1MW","SE12",137.19,0,137.19,0.88,137.19,99.08,null,0,6.4699999999999989]
["SE13-2012dec",null,"srednja - od 1MW do vključno 10MW ","SE13",113.85,0,113.85,0.91,113.85,74.44,null,0,6.6899999999999977]
["SE14-2012dec",null,"velika - nad 10MW do vključno 125MW","SE14",101.34,0,101.34,1,"(ni ZO)",58.03,null,"(ni ZO)",7.3500000000000014]
["SE21-2012dec",{"$f":"CONCATENATE(\"3.2 Sončne elektrarne - ostale\",\" \",RIGHT(A68,7))","v":"3.2 Sončne elektrarne - ostale 2012dec"},"mikro - manjše od 50kW","SE21",140.94999999999999,0,140.94999999999999,0.88,140.94999999999999,102.84,null,0,6.4699999999999989]
["SE22-2012dec",null,"mala - manjše od 1MW","SE22",129.86000000000001,0,129.86000000000001,0.88,129.86000000000001,91.75,null,0,6.4699999999999989]
["SE23-2012dec",null,"srednja - od 1MW do vključno 10MW ","SE23",104.68,0,104.68,0.91,104.68,65.27,null,0,6.6899999999999977]
["SE24-2012dec",null,"velika - nad 10MW do vključno 125MW","SE24",97.19,0,97.19,1,"(ni ZO)",53.88,null,"(ni ZO)",7.3500000000000014]
["SE11-2013jan",{"$f":"CONCATENATE(\"3.1 Sončne elektrarne - na stavbah\",\" \",RIGHT(A72,7))","v":"3.1 Sončne elektrarne - na stavbah 2013jan"},"mikro - manjše od 50kW","SE11",147,0,147,0.88,147,108.89,null,0,6.4699999999999989]
["SE12-2013jan",null,"mala - manjše od 1MW","SE12",134.44999999999999,0,134.44999999999999,0.88,134.44999999999999,96.34,null,0,6.4699999999999989]
["SE13-2013jan",null,"srednja - od 1MW do vključno 10MW ","SE13",111.57,0,111.57,0.91,111.57,72.16,null,0,6.6899999999999977]
["SE14-2013jan",null,"velika - nad 10MW do vključno 125MW","SE14",99.31,0,99.31,1,"(ni ZO)",56,null,"(ni ZO)",7.3500000000000014]
["SE21-2013jan",{"$f":"CONCATENATE(\"3.2 Sončne elektrarne - ostale\",\" \",RIGHT(A76,7))","v":"3.2 Sončne elektrarne - ostale 2013jan"},"mikro - manjše od 50kW","SE21",138.13,0,138.13,0.88,138.13,100.02,null,0,6.4699999999999989]
["SE22-2013jan",null,"mala - manjše od 1MW","SE22",127.26,0,127.26,0.88,127.26,89.15,null,0,6.4699999999999989]
["SE23-2013jan",null,"srednja - od 1MW do vključno 10MW ","SE23",102.59,0,102.59,0.91,102.59,63.18,null,0,6.6899999999999977]
["SE24-2013jan",null,"velika - nad 10MW do vključno 125MW","SE24",95.25,0,95.25,1,"(ni ZO)",51.94,null,"(ni ZO)",7.3499999999999943]
["SE11-2013feb",{"$f":"CONCATENATE(\"3.1 Sončne elektrarne - na stavbah\",\" \",RIGHT(A80,7))","v":"3.1 Sončne elektrarne - na stavbah 2013feb"},"mikro - manjše od 50kW","SE11",144.06,0,144.06,0.88,144.06,105.95,null,0,6.4699999999999989]
["SE12-2013feb",null,"mala - manjše od 1MW","SE12",131.76,0,131.76,0.88,131.76,93.65,null,0,6.4699999999999989]
["SE13-2013feb",null,"srednja - od 1MW do vključno 10MW ","SE13",109.34,0,109.34,0.91,109.34,69.930000000000007,null,0,6.6900000000000048]
["SE14-2013feb",null,"velika - nad 10MW do vključno 125MW","SE14",97.32,0,97.32,1,"(ni ZO)",54.01,null,"(ni ZO)",7.3500000000000014]
["SE21-2013feb",{"$f":"CONCATENATE(\"3.2 Sončne elektrarne - ostale\",\" \",RIGHT(A84,7))","v":"3.2 Sončne elektrarne - ostale 2013feb"},"mikro - manjše od 50kW","SE21",135.37,0,135.37,0.88,135.37,97.26,null,0,6.4699999999999989]
["SE22-2013feb",null,"mala - manjše od 1MW","SE22",124.71,0,124.71,0.88,124.71,86.6,null,0,6.4699999999999989]
["SE23-2013feb",null,"srednja - od 1MW do vključno 10MW ","SE23",100.54,0,100.54,0.91,100.54,61.13,null,0,6.6900000000000048]
["SE24-2013feb",null,"velika - nad 10MW do vključno 125MW","SE24",93.35,0,93.35,1,"(ni ZO)",50.04,null,"(ni ZO)",7.3500000000000014]
["SE11-2013mar",{"$f":"CONCATENATE(\"3.1 Sončne elektrarne - na stavbah\",\" \",RIGHT(A88,7))","v":"3.1 Sončne elektrarne - na stavbah 2013mar"},"mikro - manjše od 50kW","SE11",141.18,0,141.18,0.88,141.18,103.07,null,0,6.4699999999999989]
["SE12-2013mar",null,"mala - manjše od 1MW","SE12",129.12,0,129.12,0.88,129.12,91.01,null,0,6.4699999999999989]
["SE13-2013mar",null,"srednja - od 1MW do vključno 10MW ","SE13",107.15,0,107.15,0.91,107.15,67.739999999999995,null,0,6.6899999999999977]
["SE14-2013mar",null,"velika - nad 10MW do vključno 125MW","SE14",95.37,0,95.37,1,"(ni ZO)",52.06,null,"(ni ZO)",7.3500000000000014]
["SE21-2013mar",{"$f":"CONCATENATE(\"3.2 Sončne elektrarne - ostale\",\" \",RIGHT(A92,7))","v":"3.2 Sončne elektrarne - ostale 2013mar"},"mikro - manjše od 50kW","SE21",132.66,0,132.66,0.88,132.66,94.55,null,0,6.4699999999999989]
["SE22-2013mar",null,"mala - manjše od 1MW","SE22",122.22,0,122.22,0.88,122.22,84.11,null,0,6.4699999999999989]
["SE23-2013mar",null,"srednja - od 1MW do vključno 10MW ","SE23",98.53,0,98.53,0.91,98.53,59.12,null,0,6.6899999999999977]
["SE24-2013mar",null,"velika - nad 10MW do vključno 125MW","SE24",91.48,0,91.48,1,"(ni ZO)",48.17,null,"(ni ZO)",7.3500000000000014]
["SE11-2013apr",{"$f":"CONCATENATE(\"3.1 Sončne elektrarne - na stavbah\",\" \",RIGHT(A96,7))","v":"3.1 Sončne elektrarne - na stavbah 2013apr"},"mikro - manjše od 50kW","SE11",138.36000000000001,0,138.36000000000001,0.88,138.36000000000001,100.25,null,0,6.4699999999999989]
["SE12-2013apr",null,"mala - manjše od 1MW","SE12",126.54,0,126.54,0.88,126.54,88.43,null,0,6.4700000000000131]
["SE13-2013apr",null,"srednja - od 1MW do vključno 10MW ","SE13",105.01,0,105.01,0.91,105.01,65.599999999999994,null,0,6.6899999999999977]
["SE14-2013apr",null,"velika - nad 10MW do vključno 125MW","SE14",93.46,0,93.46,1,"(ni ZO)",50.15,null,"(ni ZO)",7.3500000000000014]
["SE21-2013apr",{"$f":"CONCATENATE(\"3.2 Sončne elektrarne - ostale\",\" \",RIGHT(A100,7))","v":"3.2 Sončne elektrarne - ostale 2013apr"},"mikro - manjše od 50kW","SE21",130.01,0,130.01,0.88,130.01,91.9,null,0,6.4699999999999989]
["SE22-2013apr",null,"mala - manjše od 1MW","SE22",119.78,0,119.78,0.88,119.78,81.67,null,0,6.4699999999999989]
["SE23-2013apr",null,"srednja - od 1MW do vključno 10MW ","SE23",96.56,0,96.56,0.91,96.56,57.15,null,0,6.6899999999999977]
["SE24-2013apr",null,"velika - nad 10MW do vključno 125MW","SE24",89.65,0,89.65,1,"(ni ZO)",46.34,null,"(ni ZO)",7.3500000000000014]
["SE11-2013maj",{"$f":"CONCATENATE(\"3.1 Sončne elektrarne - na stavbah\",\" \",RIGHT(A104,7))","v":"3.1 Sončne elektrarne - na stavbah 2013maj"},"mikro - manjše od 50kW","SE11",135.59,0,135.59,0.88,135.59,97.48,null,0,6.4699999999999989]
["SE12-2013maj",null,"mala - manjše od 1MW","SE12",124.01,0,124.01,0.88,124.01,85.9,null,0,6.4699999999999989]
["SE13-2013maj",null,"srednja - od 1MW do vključno 10MW ","SE13",102.91,0,102.91,0.91,102.91,63.5,null,0,6.6899999999999977]
["SE14-2013maj",null,"velika - nad 10MW do vključno 125MW","SE14",91.59,0,91.59,1,"(ni ZO)",48.28,null,"(ni ZO)",7.3500000000000014]
["SE21-2013maj",{"$f":"CONCATENATE(\"3.2 Sončne elektrarne - ostale\",\" \",RIGHT(A108,7))","v":"3.2 Sončne elektrarne - ostale 2013maj"},"mikro - manjše od 50kW","SE21",127.41,0,127.41,0.88,127.41,89.3,null,0,6.4699999999999989]
["SE22-2013maj",null,"mala - manjše od 1MW","SE22",117.38,0,117.38,0.88,117.38,79.27,null,0,6.4699999999999989]
["SE23-2013maj",null,"srednja - od 1MW do vključno 10MW ","SE23",94.63,0,94.63,0.91,94.63,55.22,null,0,6.6899999999999977]
["SE24-2013maj",null,"velika - nad 10MW do vključno 125MW","SE24",87.86,0,87.86,1,"(ni ZO)",44.55,null,"(ni ZO)",7.3499999999999943]
["SE11-2013jun",{"$f":"CONCATENATE(\"3.1 Sončne elektrarne - na stavbah\",\" \",RIGHT(A112,7))","v":"3.1 Sončne elektrarne - na stavbah 2013jun"},"mikro - manjše od 50kW","SE11",132.88,0,132.88,0.88,132.88,94.77,null,0,6.4699999999999989]
["SE12-2013jun",null,"mala - manjše od 1MW","SE12",121.53,0,121.53,0.88,121.53,83.42,null,0,6.4699999999999989]
["SE13-2013jun",null,"srednja - od 1MW do vključno 10MW ","SE13",100.85,0,100.85,0.91,100.85,61.44,null,0,6.6899999999999977]
["SE14-2013jun",null,"velika - nad 10MW do vključno 125MW","SE14",89.76,0,89.76,1,"(ni ZO)",46.45,null,"(ni ZO)",7.3500000000000014]
["SE21-2013jun",{"$f":"CONCATENATE(\"3.2 Sončne elektrarne - ostale\",\" \",RIGHT(A116,7))","v":"3.2 Sončne elektrarne - ostale 2013jun"},"mikro - manjše od 50kW","SE21",124.86,0,124.86,0.88,124.86,86.75,null,0,6.4699999999999989]
["SE22-2013jun",null,"mala - manjše od 1MW","SE22",115.03,0,115.03,0.88,115.03,76.92,null,0,6.4699999999999989]
["SE23-2013jun",null,"srednja - od 1MW do vključno 10MW ","SE23",92.74,0,92.74,0.91,92.74,53.33,null,0,6.6899999999999977]
["SE24-2013jun",null,"velika - nad 10MW do vključno 125MW","SE24",86.1,0,86.1,1,"(ni ZO)",42.79,null,"(ni ZO)",7.3500000000000014]
["SE11-2013jul",{"$f":"CONCATENATE(\"3.1 Sončne elektrarne - na stavbah\",\" \",RIGHT(A120,7))","v":"3.1 Sončne elektrarne - na stavbah 2013jul"},"mikro - manjše od 50kW","SE11",130.22,0,130.22,0.88,130.22,92.11,null,0,6.4699999999999989]
["SE12-2013jul",null,"mala - manjše od 1MW","SE12",119.1,0,119.1,0.88,119.1,80.989999999999995,null,0,6.4699999999999989]
["SE13-2013jul",null,"srednja - od 1MW do vključno 10MW ","SE13",98.83,0,98.83,0.91,98.83,59.42,null,0,6.6900000000000048]
["SE14-2013jul",null,"velika - nad 10MW do vključno 125MW","SE14",87.96,0,87.96,1,"(ni ZO)",44.65,null,"(ni ZO)",7.3500000000000014]
["SE21-2013jul",{"$f":"CONCATENATE(\"3.2 Sončne elektrarne - ostale\",\" \",RIGHT(A124,7))","v":"3.2 Sončne elektrarne - ostale 2013jul"},"mikro - manjše od 50kW","SE21",122.36,0,122.36,0.88,122.36,84.25,null,0,6.4699999999999989]
["SE22-2013jul",null,"mala - manjše od 1MW","SE22",112.73,0,112.73,0.88,112.73,74.62,null,0,6.4699999999999989]
["SE23-2013jul",null,"srednja - od 1MW do vključno 10MW ","SE23",90.89,0,90.89,0.91,90.89,51.48,null,0,6.6899999999999977]
["SE24-2013jul",null,"velika - nad 10MW do vključno 125MW","SE24",84.38,0,84.38,1,"(ni ZO)",41.07,null,"(ni ZO)",7.3500000000000014]
["SE11-2013avg",{"$f":"CONCATENATE(\"3.1 Sončne elektrarne - na stavbah\",\" \",RIGHT(A128,7))","v":"3.1 Sončne elektrarne - na stavbah 2013avg"},"mikro - manjše od 50kW","SE11",127.62,0,127.62,0.88,127.62,89.51,null,0,6.4699999999999989]
["SE12-2013avg",null,"mala - manjše od 1MW","SE12",116.72,0,116.72,0.88,116.72,78.61,null,0,6.4699999999999989]
["SE13-2013avg",null,"srednja - od 1MW do vključno 10MW ","SE13",96.85,0,96.85,0.91,96.85,57.44,null,0,6.6899999999999977]
["SE14-2013avg",null,"velika - nad 10MW do vključno 125MW","SE14",86.2,0,86.2,1,"(ni ZO)",42.89,null,"(ni ZO)",7.3500000000000014]
["SE21-2013avg",{"$f":"CONCATENATE(\"3.2 Sončne elektrarne - ostale\",\" \",RIGHT(A132,7))","v":"3.2 Sončne elektrarne - ostale 2013avg"},"mikro - manjše od 50kW","SE21",119.91,0,119.91,0.88,119.91,81.8,null,0,6.4699999999999989]
["SE22-2013avg",null,"mala - manjše od 1MW","SE22",110.48,0,110.48,0.88,110.48,72.37,null,0,6.4699999999999989]
["SE23-2013avg",null,"srednja - od 1MW do vključno 10MW ","SE23",89.07,0,89.07,0.91,89.07,49.66,null,0,6.6899999999999977]
["SE24-2013avg",null,"velika - nad 10MW do vključno 125MW","SE24",82.69,0,82.69,1,"(ni ZO)",39.380000000000003,null,"(ni ZO)",7.3500000000000014]
["SE11-2013sep",{"$f":"CONCATENATE(\"3.1 Sončne elektrarne - na stavbah\",\" \",RIGHT(A136,7))","v":"3.1 Sončne elektrarne - na stavbah 2013sep"},"mikro - manjše od 50kW","SE11",125.07,0,125.07,0.88,125.07,86.96,null,0,6.4699999999999989]
["SE12-2013sep",null,"mala - manjše od 1MW","SE12",114.39,0,114.39,0.88,114.39,76.28,null,0,6.4699999999999989]
["SE13-2013sep",null,"srednja - od 1MW do vključno 10MW ","SE13",94.91,0,94.91,0.91,94.91,55.5,null,0,6.6899999999999977]
["SE14-2013sep",null,"velika - nad 10MW do vključno 125MW","SE14",84.48,0,84.48,1,"(ni ZO)",41.17,null,"(ni ZO)",7.3500000000000014]
["SE21-2013sep",{"$f":"CONCATENATE(\"3.2 Sončne elektrarne - ostale\",\" \",RIGHT(A140,7))","v":"3.2 Sončne elektrarne - ostale 2013sep"},"mikro - manjše od 50kW","SE21",117.51,0,117.51,0.88,117.51,79.400000000000006,null,0,6.4699999999999989]
["SE22-2013sep",null,"mala - manjše od 1MW","SE22",108.27,0,108.27,0.88,108.27,70.16,null,0,6.4699999999999989]
["SE23-2013sep",null,"srednja - od 1MW do vključno 10MW ","SE23",87.29,0,87.29,0.91,87.29,47.88,null,0,6.6900000000000048]
["SE24-2013sep",null,"velika - nad 10MW do vključno 125MW","SE24",81.040000000000006,0,81.040000000000006,1,"(ni ZO)",37.729999999999997,null,"(ni ZO)",7.3499999999999979]
["SE11-2013okt",{"$f":"CONCATENATE(\"3.1 Sončne elektrarne - na stavbah\",\" \",RIGHT(A144,7))","v":"3.1 Sončne elektrarne - na stavbah 2013okt"},"mikro - manjše od 50kW","SE11",122.57,0,122.57,0.88,122.57,84.46,null,0,6.4699999999999989]
["SE12-2013okt",null,"mala - manjše od 1MW","SE12",112.1,0,112.1,0.88,112.1,73.989999999999995,null,0,6.4699999999999989]
["SE13-2013okt",null,"srednja - od 1MW do vključno 10MW ","SE13",93.01,0,93.01,0.91,93.01,53.6,null,0,6.6900000000000048]
["SE14-2013okt",null,"velika - nad 10MW do vključno 125MW","SE14",82.79,0,82.79,1,"(ni ZO)",39.479999999999997,null,"(ni ZO)",7.3499999999999943]
["SE21-2013okt",{"$f":"CONCATENATE(\"3.2 Sončne elektrarne - ostale\",\" \",RIGHT(A148,7))","v":"3.2 Sončne elektrarne - ostale 2013okt"},"mikro - manjše od 50kW","SE21",115.16,0,115.16,0.88,115.16,77.05,null,0,6.4699999999999989]
["SE22-2013okt",null,"mala - manjše od 1MW","SE22",106.1,0,106.1,0.88,106.1,67.989999999999995,null,0,6.4699999999999918]
["SE23-2013okt",null,"srednja - od 1MW do vključno 10MW ","SE23",85.54,0,85.54,0.91,85.54,46.13,null,0,6.6900000000000048]
["SE24-2013okt",null,"velika - nad 10MW do vključno 125MW","SE24",79.42,0,79.42,1,"(ni ZO)",36.11,null,"(ni ZO)",7.3499999999999979]
["SE11-2013nov",{"$f":"CONCATENATE(\"3.1 Sončne elektrarne - na stavbah\",\" \",RIGHT(A152,7))","v":"3.1 Sončne elektrarne - na stavbah 2013nov"},"mikro - manjše od 50kW","SE11",120.12,0,120.12,0.88,120.12,82.01,null,0,6.4699999999999989]
["SE12-2013nov",null,"mala - manjše od 1MW","SE12",109.86,0,109.86,0.88,109.86,71.75,null,0,6.4699999999999989]
["SE13-2013nov",null,"srednja - od 1MW do vključno 10MW ","SE13",91.15,0,91.15,0.91,91.15,51.74,null,0,6.6900000000000048]
["SE14-2013nov",null,"velika - nad 10MW do vključno 125MW","SE14",81.13,0,81.13,1,"(ni ZO)",37.82,null,"(ni ZO)",7.3500000000000014]
["SE21-2013nov",{"$f":"CONCATENATE(\"3.2 Sončne elektrarne - ostale\",\" \",RIGHT(A156,7))","v":"3.2 Sončne elektrarne - ostale 2013nov"},"mikro - manjše od 50kW","SE21",112.86,0,112.86,0.88,112.86,74.75,null,0,6.4699999999999989]
["SE22-2013nov",null,"mala - manjše od 1MW","SE22",103.98,0,103.98,0.88,103.98,65.87,null,0,6.470000000000006]
["SE23-2013nov",null,"srednja - od 1MW do vključno 10MW ","SE23",83.83,0,83.83,0.91,83.83,44.42,null,0,6.6900000000000048]
["SE24-2013nov",null,"velika - nad 10MW do vključno 125MW","SE24",77.83,0,77.83,1,"(ni ZO)",34.520000000000003,null,"(ni ZO)",7.3500000000000014]
["SE11-2013dec",{"$f":"CONCATENATE(\"3.1 Sončne elektrarne - na stavbah\",\" \",RIGHT(A160,7))","v":"3.1 Sončne elektrarne - na stavbah 2013dec"},"mikro - manjše od 50kW","SE11",117.72,0,117.72,0.88,117.72,79.61,null,0,6.4699999999999989]
["SE12-2013dec",null,"mala - manjše od 1MW","SE12",107.66,0,107.66,0.88,107.66,69.55,null,0,6.4699999999999989]
["SE13-2013dec",null,"srednja - od 1MW do vključno 10MW ","SE13",89.33,0,89.33,0.91,89.33,49.92,null,0,6.6900000000000048]
["SE14-2013dec",null,"velika - nad 10MW do vključno 125MW","SE14",79.510000000000005,0,79.510000000000005,1,"(ni ZO)",36.200000000000003,null,"(ni ZO)",7.3500000000000014]
["SE21-2013dec",{"$f":"CONCATENATE(\"3.2 Sončne elektrarne - ostale\",\" \",RIGHT(A164,7))","v":"3.2 Sončne elektrarne - ostale 2013dec"},"mikro - manjše od 50kW","SE21",110.6,0,110.6,0.88,110.6,72.489999999999995,null,0,6.4699999999999989]
["SE22-2013dec",null,"mala - manjše od 1MW","SE22",101.9,0,101.9,0.88,101.9,63.79,null,0,6.4699999999999989]
["SE23-2013dec",null,"srednja - od 1MW do vključno 10MW ","SE23",82.15,0,82.15,0.91,82.15,42.74,null,0,6.6900000000000048]
["SE24-2013dec",null,"velika - nad 10MW do vključno 125MW","SE24",76.27,0,76.27,1,"(ni ZO)",32.96,null,"(ni ZO)",7.3500000000000014]
["SE11-2014jan",{"$f":"CONCATENATE(\"3.1 Sončne elektrarne - na stavbah\",\" \",RIGHT(A168,7))","v":"3.1 Sončne elektrarne - na stavbah 2014jan"},"mikro - manjše od 50kW","SE11",115.37,0,115.37,0.88,115.37,77.260000000000005,null,"(ni podpore 2013)","(ni podpore 2013)"]
["SE12-2014jan",null,"mala - manjše od 1MW","SE12",105.51,0,105.51,0.88,105.51,67.400000000000006,null,"(ni podpore 2013)","(ni podpore 2013)"]
["SE13-2014jan",null,"srednja - od 1MW do vključno 10MW ","SE13",87.54,0,87.54,0.91,87.54,48.13,null,"(ni podpore 2013)","(ni podpore 2013)"]
["SE14-2014jan",null,"velika - nad 10MW do vključno 125MW","SE14",77.92,0,77.92,1,"(ni ZO)",34.61,null,"(ni podpore 2013)","(ni podpore 2013)"]
["SE21-2014jan",{"$f":"CONCATENATE(\"3.2 Sončne elektrarne - ostale\",\" \",RIGHT(A172,7))","v":"3.2 Sončne elektrarne - ostale 2014jan"},"mikro - manjše od 50kW","SE21",108.39,0,108.39,0.88,108.39,70.28,null,"(ni podpore 2013)","(ni podpore 2013)"]
["SE22-2014jan",null,"mala - manjše od 1MW","SE22",99.86,0,99.86,0.88,99.86,61.75,null,"(ni podpore 2013)","(ni podpore 2013)"]
["SE23-2014jan",null,"srednja - od 1MW do vključno 10MW ","SE23",80.510000000000005,0,80.510000000000005,0.91,80.510000000000005,41.1,null,"(ni podpore 2013)","(ni podpore 2013)"]
["SE24-2014jan",null,"velika - nad 10MW do vključno 125MW","SE24",74.739999999999995,0,74.739999999999995,1,"(ni ZO)",31.43,null,"(ni podpore 2013)","(ni podpore 2013)"]
["SE11-2014feb",{"$f":"CONCATENATE(\"3.1 Sončne elektrarne - na stavbah\",\" \",RIGHT(A176,7))","v":"3.1 Sončne elektrarne - na stavbah 2014feb"},"mikro - manjše od 50kW","SE11",113.06,0,113.06,0.88,113.06,74.95,null,"(ni podpore 2013)","(ni podpore 2013)"]
["SE12-2014feb",null,"mala - manjše od 1MW","SE12",103.4,0,103.4,0.88,103.4,65.290000000000006,null,"(ni podpore 2013)","(ni podpore 2013)"]
["SE13-2014feb",null,"srednja - od 1MW do vključno 10MW ","SE13",85.79,0,85.79,0.91,85.79,46.38,null,"(ni podpore 2013)","(ni podpore 2013)"]
["SE14-2014feb",null,"velika - nad 10MW do vključno 125MW","SE14",76.36,0,76.36,1,"(ni ZO)",33.049999999999997,null,"(ni podpore 2013)","(ni podpore 2013)"]
["SE21-2014feb",{"$f":"CONCATENATE(\"3.2 Sončne elektrarne - ostale\",\" \",RIGHT(A180,7))","v":"3.2 Sončne elektrarne - ostale 2014feb"},"mikro - manjše od 50kW","SE21",106.22,0,106.22,0.88,106.22,68.11,null,"(ni podpore 2013)","(ni podpore 2013)"]
["SE22-2014feb",null,"mala - manjše od 1MW","SE22",97.86,0,97.86,0.88,97.86,59.75,null,"(ni podpore 2013)","(ni podpore 2013)"]
["SE23-2014feb",null,"srednja - od 1MW do vključno 10MW ","SE23",78.900000000000006,0,78.900000000000006,0.91,78.900000000000006,39.49,null,"(ni podpore 2013)","(ni podpore 2013)"]
["SE24-2014feb",null,"velika - nad 10MW do vključno 125MW","SE24",73.25,0,73.25,1,"(ni ZO)",29.94,null,"(ni podpore 2013)","(ni podpore 2013)"]
["SE11-2014mar",{"$f":"CONCATENATE(\"3.1 Sončne elektrarne - na stavbah\",\" \",RIGHT(A184,7))","v":"3.1 Sončne elektrarne - na stavbah 2014mar"},"mikro - manjše od 50kW","SE11",110.8,0,110.8,0.88,110.8,72.69,null,"(ni podpore 2013)","(ni podpore 2013)"]
["SE12-2014mar",null,"mala - manjše od 1MW","SE12",101.33,0,101.33,0.88,101.33,63.22,null,"(ni podpore 2013)","(ni podpore 2013)"]
["SE13-2014mar",null,"srednja - od 1MW do vključno 10MW ","SE13",84.07,0,84.07,0.91,84.07,44.66,null,"(ni podpore 2013)","(ni podpore 2013)"]
["SE14-2014mar",null,"velika - nad 10MW do vključno 125MW","SE14",74.83,0,74.83,1,"(ni ZO)",31.52,null,"(ni podpore 2013)","(ni podpore 2013)"]
["SE21-2014mar",{"$f":"CONCATENATE(\"3.2 Sončne elektrarne - ostale\",\" \",RIGHT(A188,7))","v":"3.2 Sončne elektrarne - ostale 2014mar"},"mikro - manjše od 50kW","SE21",104.1,0,104.1,0.88,104.1,65.989999999999995,null,"(ni podpore 2013)","(ni podpore 2013)"]
["SE22-2014mar",null,"mala - manjše od 1MW","SE22",95.9,0,95.9,0.88,95.9,57.79,null,"(ni podpore 2013)","(ni podpore 2013)"]
["SE23-2014mar",null,"srednja - od 1MW do vključno 10MW ","SE23",77.319999999999993,0,77.319999999999993,0.91,77.319999999999993,37.909999999999997,null,"(ni podpore 2013)","(ni podpore 2013)"]
["SE24-2014mar",null,"velika - nad 10MW do vključno 125MW","SE24",71.790000000000006,0,71.790000000000006,1,"(ni ZO)",28.48,null,"(ni podpore 2013)","(ni podpore 2013)"]
["SE11-2014apr",{"$f":"CONCATENATE(\"3.1 Sončne elektrarne - na stavbah\",\" \",RIGHT(A192,7))","v":"3.1 Sončne elektrarne - na stavbah 2014apr"},"mikro - manjše od 50kW","SE11",108.58,0,108.58,0.88,108.58,70.47,null,"(ni podpore 2013)","(ni podpore 2013)"]
["SE12-2014apr",null,"mala - manjše od 1MW","SE12",99.3,0,99.3,0.88,99.3,61.19,null,"(ni podpore 2013)","(ni podpore 2013)"]
["SE13-2014apr",null,"srednja - od 1MW do vključno 10MW ","SE13",82.39,0,82.39,0.91,82.39,42.98,null,"(ni podpore 2013)","(ni podpore 2013)"]
["SE14-2014apr",null,"velika - nad 10MW do vključno 125MW","SE14",73.33,0,73.33,1,"(ni ZO)",30.02,null,"(ni podpore 2013)","(ni podpore 2013)"]
["SE21-2014apr",{"$f":"CONCATENATE(\"3.2 Sončne elektrarne - ostale\",\" \",RIGHT(A196,7))","v":"3.2 Sončne elektrarne - ostale 2014apr"},"mikro - manjše od 50kW","SE21",102.02,0,102.02,0.88,102.02,63.91,null,"(ni podpore 2013)","(ni podpore 2013)"]
["SE22-2014apr",null,"mala - manjše od 1MW","SE22",93.98,0,93.98,0.88,93.98,55.87,null,"(ni podpore 2013)","(ni podpore 2013)"]
["SE23-2014apr",null,"srednja - od 1MW do vključno 10MW ","SE23",75.77,0,75.77,0.91,75.77,36.36,null,"(ni podpore 2013)","(ni podpore 2013)"]
["SE24-2014apr",null,"velika - nad 10MW do vključno 125MW","SE24",70.349999999999994,0,70.349999999999994,1,"(ni ZO)",27.04,null,"(ni podpore 2013)","(ni podpore 2013)"]
["SE11-2014maj",{"$f":"CONCATENATE(\"3.1 Sončne elektrarne - na stavbah\",\" \",RIGHT(A200,7))","v":"3.1 Sončne elektrarne - na stavbah 2014maj"},"mikro - manjše od 50kW","SE11",106.41,0,106.41,0.88,106.41,68.3,null,"(ni podpore 2013)","(ni podpore 2013)"]
["SE12-2014maj",null,"mala - manjše od 1MW","SE12",97.31,0,97.31,0.88,97.31,59.2,null,"(ni podpore 2013)","(ni podpore 2013)"]
["SE13-2014maj",null,"srednja - od 1MW do vključno 10MW ","SE13",80.739999999999995,0,80.739999999999995,0.91,80.739999999999995,41.33,null,"(ni podpore 2013)","(ni podpore 2013)"]
["SE14-2014maj",null,"velika - nad 10MW do vključno 125MW","SE14",71.86,0,71.86,1,"(ni ZO)",28.55,null,"(ni podpore 2013)","(ni podpore 2013)"]
["SE21-2014maj",{"$f":"CONCATENATE(\"3.2 Sončne elektrarne - ostale\",\" \",RIGHT(A204,7))","v":"3.2 Sončne elektrarne - ostale 2014maj"},"mikro - manjše od 50kW","SE21",99.98,0,99.98,0.88,99.98,61.87,null,"(ni podpore 2013)","(ni podpore 2013)"]
["SE22-2014maj",null,"mala - manjše od 1MW","SE22",92.1,0,92.1,0.88,92.1,53.99,null,"(ni podpore 2013)","(ni podpore 2013)"]
["SE23-2014maj",null,"srednja - od 1MW do vključno 10MW ","SE23",74.25,0,74.25,0.91,74.25,34.840000000000003,null,"(ni podpore 2013)","(ni podpore 2013)"]
["SE24-2014maj",null,"velika - nad 10MW do vključno 125MW","SE24",68.94,0,68.94,1,"(ni ZO)",25.63,null,"(ni podpore 2013)","(ni podpore 2013)"]
["SE11-2014jun",{"$f":"CONCATENATE(\"3.1 Sončne elektrarne - na stavbah\",\" \",RIGHT(A208,7))","v":"3.1 Sončne elektrarne - na stavbah 2014jun"},"mikro - manjše od 50kW","SE11",104.28,0,104.28,0.88,104.28,66.17,null,"(ni podpore 2013)","(ni podpore 2013)"]
["SE12-2014jun",null,"mala - manjše od 1MW","SE12",95.36,0,95.36,0.88,95.36,57.25,null,"(ni podpore 2013)","(ni podpore 2013)"]
["SE13-2014jun",null,"srednja - od 1MW do vključno 10MW ","SE13",79.13,0,79.13,0.91,79.13,39.72,null,"(ni podpore 2013)","(ni podpore 2013)"]
["SE14-2014jun",null,"velika - nad 10MW do vključno 125MW","SE14",70.42,0,70.42,1,"(ni ZO)",27.11,null,"(ni podpore 2013)","(ni podpore 2013)"]
["SE21-2014jun",{"$f":"CONCATENATE(\"3.2 Sončne elektrarne - ostale\",\" \",RIGHT(A212,7))","v":"3.2 Sončne elektrarne - ostale 2014jun"},"mikro - manjše od 50kW","SE21",97.98,0,97.98,0.88,97.98,59.87,null,"(ni podpore 2013)","(ni podpore 2013)"]
["SE22-2014jun",null,"mala - manjše od 1MW","SE22",90.26,0,90.26,0.88,90.26,52.15,null,"(ni podpore 2013)","(ni podpore 2013)"]
["SE23-2014jun",null,"srednja - od 1MW do vključno 10MW ","SE23",72.77,0,72.77,0.91,72.77,33.36,null,"(ni podpore 2013)","(ni podpore 2013)"]
["SE24-2014jun",null,"velika - nad 10MW do vključno 125MW","SE24",67.56,0,67.56,1,"(ni ZO)",24.25,null,"(ni podpore 2013)","(ni podpore 2013)"]
["SE11-2014jul",{"$f":"CONCATENATE(\"3.1 Sončne elektrarne - na stavbah\",\" \",RIGHT(A216,7))","v":"3.1 Sončne elektrarne - na stavbah 2014jul"},"mikro - manjše od 50kW","SE11",102.19,0,102.19,0.88,102.19,64.08,null,"(ni podpore 2013)","(ni podpore 2013)"]
["SE12-2014jul",null,"mala - manjše od 1MW","SE12",93.45,0,93.45,0.88,93.45,55.34,null,"(ni podpore 2013)","(ni podpore 2013)"]
["SE13-2014jul",null,"srednja - od 1MW do vključno 10MW ","SE13",77.55,0,77.55,0.91,77.55,38.14,null,"(ni podpore 2013)","(ni podpore 2013)"]
["SE14-2014jul",null,"velika - nad 10MW do vključno 125MW","SE14",69.010000000000005,0,69.010000000000005,1,"(ni ZO)",25.7,null,"(ni podpore 2013)","(ni podpore 2013)"]
["SE21-2014jul",{"$f":"CONCATENATE(\"3.2 Sončne elektrarne - ostale\",\" \",RIGHT(A220,7))","v":"3.2 Sončne elektrarne - ostale 2014jul"},"mikro - manjše od 50kW","SE21",96.02,0,96.02,0.88,96.02,57.91,null,"(ni podpore 2013)","(ni podpore 2013)"]
["SE22-2014jul",null,"mala - manjše od 1MW","SE22",88.45,0,88.45,0.88,88.45,50.34,null,"(ni podpore 2013)","(ni podpore 2013)"]
["SE23-2014jul",null,"srednja - od 1MW do vključno 10MW ","SE23",71.31,0,71.31,0.91,71.31,31.9,null,"(ni podpore 2013)","(ni podpore 2013)"]
["SE24-2014jul",null,"velika - nad 10MW do vključno 125MW","SE24",66.209999999999994,0,66.209999999999994,1,"(ni ZO)",22.9,null,"(ni podpore 2013)","(ni podpore 2013)"]
["SE11-2014avg",{"$f":"CONCATENATE(\"3.1 Sončne elektrarne - na stavbah\",\" \",RIGHT(A224,7))","v":"3.1 Sončne elektrarne - na stavbah 2014avg"},"mikro - manjše od 50kW","SE11",100.15,0,100.15,0.88,100.15,62.04,null,"(ni podpore 2013)","(ni podpore 2013)"]
["SE12-2014avg",null,"mala - manjše od 1MW","SE12",91.58,0,91.58,0.88,91.58,53.47,null,"(ni podpore 2013)","(ni podpore 2013)"]
["SE13-2014avg",null,"srednja - od 1MW do vključno 10MW ","SE13",76,0,76,0.91,76,36.590000000000003,null,"(ni podpore 2013)","(ni podpore 2013)"]
["SE14-2014avg",null,"velika - nad 10MW do vključno 125MW","SE14",67.63,0,67.63,1,"(ni ZO)",24.32,null,"(ni podpore 2013)","(ni podpore 2013)"]
["SE21-2014avg",{"$f":"CONCATENATE(\"3.2 Sončne elektrarne - ostale\",\" \",RIGHT(A228,7))","v":"3.2 Sončne elektrarne - ostale 2014avg"},"mikro - manjše od 50kW","SE21",94.1,0,94.1,0.88,94.1,55.99,null,"(ni podpore 2013)","(ni podpore 2013)"]
["SE22-2014avg",null,"mala - manjše od 1MW","SE22",86.68,0,86.68,0.88,86.68,48.57,null,"(ni podpore 2013)","(ni podpore 2013)"]
["SE23-2014avg",null,"srednja - od 1MW do vključno 10MW ","SE23",69.88,0,69.88,0.91,69.88,30.47,null,"(ni podpore 2013)","(ni podpore 2013)"]
["SE24-2014avg",null,"velika - nad 10MW do vključno 125MW","SE24",64.89,0,64.89,1,"(ni ZO)",21.58,null,"(ni podpore 2013)","(ni podpore 2013)"]
["SE11-2014sep",{"$f":"CONCATENATE(\"3.1 Sončne elektrarne - na stavbah\",\" \",RIGHT(A232,7))","v":"3.1 Sončne elektrarne - na stavbah 2014sep"},"mikro - manjše od 50kW","SE11",98.15,0,98.15,0.88,98.15,60.04,null,"(ni podpore 2013)","(ni podpore 2013)"]
["SE12-2014sep",null,"mala - manjše od 1MW","SE12",89.75,0,89.75,0.88,89.75,51.64,null,"(ni podpore 2013)","(ni podpore 2013)"]
["SE13-2014sep",null,"srednja - od 1MW do vključno 10MW ","SE13",74.48,0,74.48,0.91,74.48,35.07,null,"(ni podpore 2013)","(ni podpore 2013)"]
["SE14-2014sep",null,"velika - nad 10MW do vključno 125MW","SE14",66.28,0,66.28,1,"(ni ZO)",22.97,null,"(ni podpore 2013)","(ni podpore 2013)"]
["SE21-2014sep",{"$f":"CONCATENATE(\"3.2 Sončne elektrarne - ostale\",\" \",RIGHT(A236,7))","v":"3.2 Sončne elektrarne - ostale 2014sep"},"mikro - manjše od 50kW","SE21",92.22,0,92.22,0.88,92.22,54.11,null,"(ni podpore 2013)","(ni podpore 2013)"]
["SE22-2014sep",null,"mala - manjše od 1MW","SE22",84.95,0,84.95,0.88,84.95,46.84,null,"(ni podpore 2013)","(ni podpore 2013)"]
["SE23-2014sep",null,"srednja - od 1MW do vključno 10MW ","SE23",68.48,0,68.48,0.91,68.48,29.07,null,"(ni podpore 2013)","(ni podpore 2013)"]
["SE24-2014sep",null,"velika - nad 10MW do vključno 125MW","SE24",63.59,0,63.59,1,"(ni ZO)",20.28,null,"(ni podpore 2013)","(ni podpore 2013)"]
["SE11-2014okt",{"$f":"CONCATENATE(\"3.1 Sončne elektrarne - na stavbah\",\" \",RIGHT(A240,7))","v":"3.1 Sončne elektrarne - na stavbah 2014okt"},"mikro - manjše od 50kW","SE11",96.19,0,96.19,0.88,96.19,58.08,null,"(ni podpore 2013)","(ni podpore 2013)"]
["SE12-2014okt",null,"mala - manjše od 1MW","SE12",87.96,0,87.96,0.88,87.96,49.85,null,"(ni podpore 2013)","(ni podpore 2013)"]
["SE13-2014okt",null,"srednja - od 1MW do vključno 10MW ","SE13",72.989999999999995,0,72.989999999999995,0.91,72.989999999999995,33.58,null,"(ni podpore 2013)","(ni podpore 2013)"]
["SE14-2014okt",null,"velika - nad 10MW do vključno 125MW","SE14",64.95,0,64.95,1,"(ni ZO)",21.64,null,"(ni podpore 2013)","(ni podpore 2013)"]
["SE21-2014okt",{"$f":"CONCATENATE(\"3.2 Sončne elektrarne - ostale\",\" \",RIGHT(A244,7))","v":"3.2 Sončne elektrarne - ostale 2014okt"},"mikro - manjše od 50kW","SE21",90.38,0,90.38,0.88,90.38,52.27,null,"(ni podpore 2013)","(ni podpore 2013)"]
["SE22-2014okt",null,"mala - manjše od 1MW","SE22",83.25,0,83.25,0.88,83.25,45.14,null,"(ni podpore 2013)","(ni podpore 2013)"]
["SE23-2014okt",null,"srednja - od 1MW do vključno 10MW ","SE23",67.11,0,67.11,0.91,67.11,27.7,null,"(ni podpore 2013)","(ni podpore 2013)"]
["SE24-2014okt",null,"velika - nad 10MW do vključno 125MW","SE24",62.32,0,62.32,1,"(ni ZO)",19.010000000000002,null,"(ni podpore 2013)","(ni podpore 2013)"]
["SE11-2014nov",{"$f":"CONCATENATE(\"3.1 Sončne elektrarne - na stavbah\",\" \",RIGHT(A248,7))","v":"3.1 Sončne elektrarne - na stavbah 2014nov"},"mikro - manjše od 50kW","SE11",94.27,0,94.27,0.88,94.27,56.16,null,"(ni podpore 2013)","(ni podpore 2013)"]
["SE12-2014nov",null,"mala - manjše od 1MW","SE12",86.2,0,86.2,0.88,86.2,48.09,null,"(ni podpore 2013)","(ni podpore 2013)"]
["SE13-2014nov",null,"srednja - od 1MW do vključno 10MW ","SE13",71.53,0,71.53,0.91,71.53,32.119999999999997,null,"(ni podpore 2013)","(ni podpore 2013)"]
["SE14-2014nov",null,"velika - nad 10MW do vključno 125MW","SE14",63.65,0,63.65,1,"(ni ZO)",20.34,null,"(ni podpore 2013)","(ni podpore 2013)"]
["SE21-2014nov",{"$f":"CONCATENATE(\"3.2 Sončne elektrarne - ostale\",\" \",RIGHT(A252,7))","v":"3.2 Sončne elektrarne - ostale 2014nov"},"mikro - manjše od 50kW","SE21",88.57,0,88.57,0.88,88.57,50.46,null,"(ni podpore 2013)","(ni podpore 2013)"]
["SE22-2014nov",null,"mala - manjše od 1MW","SE22",81.59,0,81.59,0.88,81.59,43.48,null,"(ni podpore 2013)","(ni podpore 2013)"]
["SE23-2014nov",null,"srednja - od 1MW do vključno 10MW ","SE23",65.77,0,65.77,0.91,65.77,26.36,null,"(ni podpore 2013)","(ni podpore 2013)"]
["SE24-2014nov",null,"velika - nad 10MW do vključno 125MW","SE24",61.07,0,61.07,1,"(ni ZO)",17.760000000000002,null,"(ni podpore 2013)","(ni podpore 2013)"]
["SE11-2014dec",{"$f":"CONCATENATE(\"3.1 Sončne elektrarne - na stavbah\",\" \",RIGHT(A256,7))","v":"3.1 Sončne elektrarne - na stavbah 2014dec"},"mikro - manjše od 50kW","SE11",92.38,0,92.38,0.88,92.38,54.27,null,"(ni podpore 2013)","(ni podpore 2013)"]
["SE12-2014dec",null,"mala - manjše od 1MW","SE12",84.48,0,84.48,0.88,84.48,46.37,null,"(ni podpore 2013)","(ni podpore 2013)"]
["SE13-2014dec",null,"srednja - od 1MW do vključno 10MW ","SE13",70.099999999999994,0,70.099999999999994,0.91,70.099999999999994,30.69,null,"(ni podpore 2013)","(ni podpore 2013)"]
["SE14-2014dec",null,"velika - nad 10MW do vključno 125MW","SE14",62.38,0,62.38,1,"(ni ZO)",19.07,null,"(ni podpore 2013)","(ni podpore 2013)"]
["SE21-2014dec",{"$f":"CONCATENATE(\"3.2 Sončne elektrarne - ostale\",\" \",RIGHT(A260,7))","v":"3.2 Sončne elektrarne - ostale 2014dec"},"mikro - manjše od 50kW","SE21",86.8,0,86.8,0.88,86.8,48.69,null,"(ni podpore 2013)","(ni podpore 2013)"]
["SE22-2014dec",null,"mala - manjše od 1MW","SE22",79.959999999999994,0,79.959999999999994,0.88,79.959999999999994,41.85,null,"(ni podpore 2013)","(ni podpore 2013)"]
["SE23-2014dec",null,"srednja - od 1MW do vključno 10MW ","SE23",64.45,0,64.45,0.91,64.45,25.04,null,"(ni podpore 2013)","(ni podpore 2013)"]
["SE24-2014dec",null,"velika - nad 10MW do vključno 125MW","SE24",59.85,0,59.85,1,"(ni ZO)",16.54,null,"(ni podpore 2013)","(ni podpore 2013)"]
["GT01","4. Geotermalne elektrarne","mikro - manjše od 50kW","GT01",152.47,0,152.47,0.92,152.47,112.62,null,0,6.7600000000000051]
["GT02",null,"mala - manjše od 1MW","GT02",152.47,0,152.47,0.92,152.47,112.62,null,0,6.7600000000000051]
["GT03",null,"srednja - od 1MW do vključno 10MW ","GT03",152.47,0,152.47,0.92,152.47,112.62,null,0,6.7600000000000051]
["GT04",null,"velika - nad 10MW do vključno 125MW","GT04","(indvid.)",0,"(indvid.)",0.92,"(ni ZO)","(indvid.)",null,"(ni ZO; individ.)","(individ.)"]
["LB11","5.1 Elektrarne na lesno biomaso","mikro - manjše od 50kW","LB11","(indvid.)","(indvid.)","(indvid.)",0.88,"(indvid.)","(indvid.)",null,"(individ.)","(individ.)"]
["LB12",null,"mala - manjše od 1MW","LB12",161.94999999999999,90.15,252.1,0.91,252.1,212.69,null,-0.4299999999999784,6.2599999999999909]
["LB13",null,"srednja - od 1MW do vključno 10MW ","LB13",115.52,75.010000000000005,190.53,0.92,190.53,150.68,null,-0.35999999999998522,6.4000000000000057]
["LB14",null,"velika - nad 10MW do vključno 125MW","LB14","(indvid.)","(indvid.)","(indvid.)",0.92,"(ni ZO)","(indvid.)",null,"(ni ZO; individ.)","(individ.)"]
["LB21","5.2.Sosežig lesne biomase >5%","mikro - manjše od 50kW","LB21",51.34,73.97,125.31,0.88,"(ni ZO)",87.2,null,"(ni ZO)",6.1200000000000045]
["LB22",null,"mala - manjše od 1MW","LB22",51.34,73.97,125.31,0.91,"(ni ZO)",85.9,null,"(ni ZO)",6.3400000000000034]
["LB23",null,"srednja - od 1MW do vključno 10MW ","LB23",51.34,73.97,125.31,0.92,"(ni ZO)",85.46,null,"(ni ZO)",6.4099999999999966]
["LB24",null,"velika - nad 10MW do vključno 125MW","LB24",null,null,"(indvid.)",0.92,"(ni ZO)","(indvid.)",null,"(ni ZO; individ.)","(individ.)"]
["LB31","5.3.Sosežig lesne biomase <5%","mikro - manjše od 50kW","LB31",0,68.28,68.28,"OP=SDRS","(ni ZO)",68.28,null,"(ni ZO)",0.35999999999999943]
["LB32",null,"mala - manjše od 1MW","LB32",0,68.28,68.28,"OP=SDRS","(ni ZO)",68.28,null,"(ni ZO)",0.35999999999999943]
["LB33",null,"srednja - od 1MW do vključno 10MW ","LB33",0,68.28,68.28,"OP=SDRS","(ni ZO)",68.28,null,"(ni ZO)",0.35999999999999943]
["LB34",null,"velika - nad 10MW do vključno 125MW","LB34",0,68.28,68.28,"OP=SDRS","(ni ZO)",68.28,null,"(ni ZO)",0.35999999999999943]
["BP11","6.1 Bioplinske enote - biomasa","mikro - manjše od 50kW","BP11",118.72,46.83,165.55,0.88,165.55,127.44,null,-4.9899999999999807,1.480000000000004]
["BP12",null,"mala - manjše od 1MW","BP12",111.75,50,161.75,0.91,161.75,122.34,null,-5.4399999999999977,1.25]
["BP13",null,"srednja - od 1MW do vključno 10MW ","BP13",96.18,51.59,147.77000000000001,0.92,147.77000000000001,107.92,null,-6.3499999999999943,0.40999999999999659]
["BP14",null,"velika - nad 10MW do vključno 125MW","BP14","(ni predv.)","(ni predv.)","(ni predv.)",1,"(ni predv.)","(ni predv.)",null,"(ni predv.)","(ni predv.)"]
["BP21","6.2 Bioplinske enote - odpadki","mikro - manjše od 50kW","BP21",139.22999999999999,0,139.22999999999999,0.88,139.22999999999999,101.12,null,0,6.4699999999999989]
["BP22",null,"mala - manjše od 1MW","BP22",139.22999999999999,0,139.22999999999999,0.91,139.22999999999999,99.82,null,0,6.6899999999999977]
["BP23",null,"srednja - od 1MW do vključno 10MW ","BP23",129.15,0,129.15,0.92,129.15,89.3,null,0,6.7599999999999909]
["BP24",null,"velika - nad 10MW do vključno 125MW","BP24","(ni predv.)","(ni predv.)","(ni predv.)",1,"(ni predv.)","(ni predv.)",null,"(ni predv.)","(ni predv.)"]
["ČN01","7. Elektrarne na bioplin iz čistilnih naprav","mikro - manjše od 50kW","ČN01",85.84,0,85.84,0.92,85.84,45.99,null,0,6.7600000000000051]
["ČN02",null,"mala - manjše od 1MW","ČN02",74.42,0,74.42,0.92,74.42,34.57,null,0,6.7600000000000016]
["ČN03",null,"srednja - od 1MW do vključno 10MW ","ČN03",66.09,0,66.09,0.92,66.09,26.24,null,0,6.759999999999998]
["ČN04",null,"velika - nad 10MW do vključno 125MW","ČN04","(ni predv.)","(ni predv.)","(ni predv.)",1,"(ni predv.)","(ni predv.)",null,"(ni predv.)","(ni predv.)"]
["OP01","8. Elektrarne na odlagališčni plin","mikro - manjše od 50kW","OP01",99.33,0,99.33,0.92,99.33,59.48,null,0,6.759999999999998]
["OP02",null,"mala - manjše od 1MW","OP02",67.47,0,67.47,0.92,67.47,27.62,null,0,6.7600000000000016]
["OP03",null,"srednja - od 1MW do vključno 10MW ","OP03",61.67,0,61.67,0.92,61.67,21.82,null,0,6.76]
["OP04",null,"velika - nad 10MW do vključno 125MW","OP04","(ni predv.)","(ni predv.)","(ni predv.)",1,"(ni predv.)","(ni predv.)",null,"(ni predv.)","(ni predv.)"]
["BO01","9. Elektrarne na biološko razgradljive odpadke","mikro - manjše od 50kW","BO01","(ni predv.)","(ni predv.)","(ni predv.)",0.92,"(ni predv.)","(ni predv.)",null,"(ni predv.)","(ni predv.)"]
["BO02",null,"mala - manjše od 1MW","BO02",77.44,0,77.44,0.92,77.44,37.590000000000003,null,0,6.7600000000000051]
["BO03",null,"srednja - od 1MW do vključno 10MW ","BO03",74.34,0,74.34,0.92,74.34,34.49,null,0,6.7600000000000016]
["BO04",null,"velika - nad 10MW do vključno 125MW","BO04","(indvid.)",0,"(indvid.)",0.92,"(ni ZO)","(indvid.)",null,"(ni ZO; individ.)","(individ.)"]
["SL11","10. SPTE na lesno biomaso (do 4.000 ur)","mikro - manjše od 50kW","SL11","(indvid.)","(indvid.)","(indvid.)",0.85,"(indvid.)","(indvid.)",null,"(individ.)","(individ.)"]
["SL12",null,"mala - manjše od 1MW","SL12",293.27,48.3,341.57,0.88,341.57,303.45999999999998,null,-0.22999999999996135,6.2399999999999523]
["SL13",null,"srednja - nižja - od 1MW do vključno 5MW","SL13",221.27,45.45,266.72000000000003,0.93,"(ni ZO)",226.44,null,"(ni ZO)",6.6099999999999852]
["SL14",null,"srednja - višja - nad 5MW do vključno 25MW","SL14",159.27000000000001,40.06,199.33,0.93,"(ni ZO)",159.05000000000001,null,"(ni ZO)",6.6400000000000148]
["SL15",null,"velika - nižja - nad 25MW do vključno 50MW","SL15",127.05,41.39,168.44,0.96,"(ni ZO)",126.86,null,"(ni ZO)",6.8499999999999943]
["SL16",null,"velika - višja - nad 50MW do 200MW","SL16","(indvid.)","(indvid.)","(indvid.)",0.96,"(ni ZO)","(indvid.)",null,"(ni ZO; individ.)","(individ.)"]
["SL21","10. SPTE na lesno biomaso (več kot 4.000 ur)","mikro - manjše od 50kW","SL21","(indvid.)","(indvid.)","(indvid.)",0.9,"(indvid.)","(indvid.)",null,"(individ.)","(individ.)"]
["SL22",null,"mala - manjše od 1MW","SL22",186.62,48.3,234.92000000000002,0.92,234.92000000000002,195.07,null,-0.22999999999998977,6.5300000000000011]
["SL23",null,"srednja - nižja - od 1MW do vključno 5MW","SL23",140.81,45.45,186.26,0.94,"(ni ZO)",145.55000000000001,null,"(ni ZO)",6.6899999999999977]
["SL24",null,"srednja - višja - nad 5MW do vključno 25MW","SL24",101.36,40.06,141.42000000000002,0.94,"(ni ZO)",100.71,null,"(ni ZO)",6.7199999999999989]
["SL25",null,"velika - nižja - nad 25MW do vključno 50MW","SL25",80.849999999999994,41.39,122.24,0.97,"(ni ZO)",80.23,null,"(ni ZO)",6.9300000000000068]
["SL26",null,"velika - višja - nad 50MW do 200MW","SL26","(indvid.)","(indvid.)","(indvid.)",0.97,"(ni ZO)","(indvid.)",null,"(ni ZO; individ.)","(individ.)"]
["SF11","11. SPTE na fosilna goriva (do 4.000 ur)","mikro - manjše od 50kW","SF11",174.07,68.099999999999994,242.17,0.85,242.17,205.36,null,-13.77000000000001,-7.5199999999999818]
["SF12",null,"mala - manjše od 1MW","SF12",92.94,68.41,161.35,0.88,161.35,123.24,null,-14.680000000000007,-8.2099999999999937]
["SF13",null,"srednja - nižja - od 1MW do vključno 5MW","SF13",73.099999999999994,54.15,127.25,0.93,"(ni ZO)",86.97,null,"(ni ZO)",-8.5700000000000074]
["SF14",null,"srednja - višja - nad 5MW do vključno 25MW","SF14",64,60.68,124.68,0.93,"(ni ZO)",84.4,null,"(ni ZO)",-10.789999999999992]
["SF15",null,"velika - nižja - nad 25MW do vključno 50MW","SF15",72.5,54.86,127.36,0.96,"(ni ZO)",85.78,null,"(ni ZO)",-9.1500000000000057]
["SF16",null,"velika - višja - nad 50MW do 200MW","SF16",66.2,50.18,116.38,0.96,"(ni ZO)",74.8,null,"(ni ZO)",-7.9900000000000091]
["SF21","11. SPTE na fosilna goriva (več kot 4.000 ur)","mikro - manjše od 50kW","SF21",116.23,68.099999999999994,184.32999999999998,0.9,184.32999999999998,145.35,null,-13.770000000000039,-7.1599999999999966]
["SF22",null,"mala - manjše od 1MW","SF22",62.41,68.41,130.82,0.92,130.82,90.97,null,-14.680000000000007,-7.9200000000000017]
["SF23",null,"srednja - nižja - od 1MW do vključno 5MW","SF23",49.43,54.15,103.58,0.94,"(ni ZO)",62.87,null,"(ni ZO)",-8.490000000000002]
["SF24",null,"srednja - višja - nad 5MW do vključno 25MW","SF24",43.27,60.68,103.95,0.94,"(ni ZO)",63.24,null,"(ni ZO)",-10.71]
["SF25",null,"velika - nižja - nad 25MW do vključno 50MW","SF25",47.59,54.86,102.45,0.97,"(ni ZO)",60.44,null,"(ni ZO)",-9.0700000000000074]
["SF26",null,"velika - višja - nad 50MW do 200MW","SF26",43.22,50.18,93.4,0.97,"(ni ZO)",51.39,null,"(ni ZO)",-7.9099999999999966]
["SF11","11. SPTE na fosilna goriva (do 4.000 ur) - druga polovica 2014!","mikro - manjše od 50kW","SF11",174.07,75.06,249.13,0.85,249.13,212.32,null,-6.8100000000000023,-0.56000000000000227]
["SF12",null,"mala - manjše od 1MW","SF12",92.94,75.819999999999993,168.76,0.88,168.76,130.65,null,-7.2700000000000102,-0.79999999999998295]
["SF13",null,"srednja - nižja - od 1MW do vključno 5MW","SF13",73.099999999999994,61.93,135.03,0.93,"(ni ZO)",94.75,null,"(ni ZO)",-0.79000000000000625]
["SF14",null,"srednja - višja - nad 5MW do vključno 25MW","SF14",64,69.58,133.57999999999998,0.93,"(ni ZO)",93.3,null,"(ni ZO)",-1.8900000000000006]
["SF15",null,"velika - nižja - nad 25MW do vključno 50MW","SF15",72.5,63.04,135.54,0.96,"(ni ZO)",93.96,null,"(ni ZO)",-0.97000000000001307]
["SF16",null,"velika - višja - nad 50MW do 200MW","SF16",66.2,57.78,123.98,0.96,"(ni ZO)",82.4,null,"(ni ZO)",-0.39000000000000057]
["SF21","11. SPTE na fosilna goriva (več kot 4.000 ur) - druga polovica 2014!","mikro - manjše od 50kW","SF21",116.23,75.06,191.29000000000002,0.9,191.29000000000002,152.31,null,-6.8100000000000023,-0.19999999999998863]
["SF22",null,"mala - manjše od 1MW","SF22",62.41,75.819999999999993,138.22999999999999,0.92,138.22999999999999,98.38,null,-7.2700000000000102,-0.51000000000000512]
["SF23",null,"srednja - nižja - od 1MW do vključno 5MW","SF23",49.43,61.93,111.36,0.94,"(ni ZO)",70.650000000000006,null,"(ni ZO)",-0.70999999999999375]
["SF24",null,"srednja - višja - nad 5MW do vključno 25MW","SF24",43.27,69.58,112.85,0.94,"(ni ZO)",72.14,null,"(ni ZO)",-1.8100000000000023]
["SF25",null,"velika - nižja - nad 25MW do vključno 50MW","SF25",47.59,63.04,110.63,0.97,"(ni ZO)",68.62,null,"(ni ZO)",-0.89000000000000057]
["SF26",null,"velika - višja - nad 50MW do 200MW","SF26",43.22,57.78,101,0.97,"(ni ZO)",58.99,null,"(ni ZO)",-0.30999999999999517]
[]
[]
[]
[]
[]
[null,null,null,2014,2013,2012,2011,2010,2009,"Indeks cene 2014"]
[null,"EE","€/MWh",43.31,50.66,55.79,53.13,53.41,65]
[null,"PREMOG","EUR/GJ",2.54,2.61,2.65,2.83,2.87,3.5]
[null,"LB sosežig","EUR/GJ",8.23,8.27,7.7,6.56,5.83,5.7]
[null,"lesna biomasa - Clb","€/t",58.22,58.5,54.47,46.4,41.2,40.299999999999997,1.4446699999999999]
[null,"koruzna silaža - Cs","EUR/t",28,32,24,24,24,23.59,1.1869400000000001]
[null,"zemeljski plin - Cb","€/Sm3",0.30420000000000003,0.40870000000000001,0.37680000000000002,0.33439999999999998,0.26790000000000003,0.24,1.2675000000000001]
[null,"zemeljski plin - Cb (druga polovica 2014)","€/Sm3",0.35699999999999998,null,null,null,null,0.24,{"$f":"ROUND(D348/I348,5)","v":1.4875}]

{"sheet":"Podpore 2016","index":5,"n_rows":310,"n_cols":13,"rows_kept":310,"cut":false,"hidden":false,"merged":[[19,1,22,1],[0,0,0,9],[3,1,6,1],[7,1,10,1],[11,1,14,1],[15,1,18,1],[67,1,70,1],[23,1,26,1],[27,1,30,1],[31,1,34,1],[35,1,38,1],[39,1,42,1],[43,1,46,1],[47,1,50,1],[51,1,54,1],[55,1,58,1],[59,1,62,1],[63,1,66,1],[115,1,118,1],[71,1,74,1],[75,1,78,1],[79,1,82,1],[83,1,86,1],[87,1,90,1],[91,1,94,1],[95,1,98,1],[99,1,102,1],[103,1,106,1],[107,1,110,1],[111,1,114,1],[163,1,166,1],[119,1,122,1],[123,1,126,1],[127,1,130,1],[131,1,134,1],[135,1,138,1],[139,1,142,1],[143,1,146,1],[147,1,150,1],[151,1,154,1],[155,1,158,1],[159,1,162,1],[211,1,214,1],[167,1,170,1],[171,1,174,1],[175,1,178,1],[179,1,182,1],[183,1,186,1],[187,1,190,1],[191,1,194,1],[195,1,198,1],[199,1,202,1],[203,1,206,1],[207,1,210,1],[259,1,262,1],[215,1,218,1],[219,1,222,1],[223,1,226,1],[227,1,230,1],[231,1,234,1],[235,1,238,1],[239,1,242,1],[243,1,246,1],[247,1,250,1],[251,1,254,1],[255,1,258,1],[293,1,298,1],[263,1,266,1],[267,1,270,1],[271,1,274,1],[275,1,280,1],[281,1,286,1],[287,1,292,1]]}
["VIŠINE PODPOR 2016"]
[]
[null,null,null,"KODA","NDRS 2016","SDRS 2016","Skupni stroški 2016","Faktor B po Prilogi III","Cena ZO 2016","Višina OP 2016",null,"ZO2016 - ZO2015","OP2016 - OP2015"]
["HE01","1. Hidroelektrarne","mikro - manjše od 50kW","HE01",105.47,0,105.47,0.86,105.47,73.739999999999995,null,0,2.3699999999999903]
["HE02",null,"mala - manjše od 1MW","HE02",92.61,0,92.61,0.86,92.61,60.88,null,0,2.3700000000000045]
["HE03",null,"srednja - od 1MW do vključno 10MW ","HE03",82.34,0,82.34,0.9,82.34,49.14,null,0,2.480000000000004]
["HE04",null,"velika - nad 10MW do vključno 125MW","HE04",76.569999999999993,0,76.569999999999993,0.9,"(ni ZO)",43.37,null,"(ni ZO)",2.4799999999999969]
["VE01","2. Vetrne elektrarne","mikro - manjše od 50kW","VE01",95.38,0,95.38,0.8,95.38,65.87,null,0,2.210000000000008]
["VE02",null,"mala - manjše od 1MW","VE02",95.38,0,95.38,0.8,95.38,65.87,null,0,2.210000000000008]
["VE03",null,"srednja - od 1MW do vključno 10MW ","VE03",95.38,0,95.38,0.8,95.38,65.87,null,0,2.210000000000008]
["VE04",null,"velika - nad 10MW do vključno 125MW","VE04",86.74,0,86.74,0.86,"(ni ZO)",55.01,null,"(ni ZO)",2.3699999999999974]
["SE11-2009","3.1 Sončne elektrarne - na stavbah 2009","mikro - manjše od 50kW","SE11",415.46,0,415.46,0.88,415.46,383,null,0,2.4300000000000068]
["SE12-2009",null,"mala - manjše od 1MW","SE12",380.02,0,380.02,0.88,380.02,347.56,null,0,2.4300000000000068]
["SE13-2009",null,"srednja - od 1MW do vključno 10MW ","SE13",315.36,0,315.36,0.91,315.36,281.79000000000002,null,0,2.5100000000000477]
["SE14-2009",null,"velika - nad 10MW do vključno 125MW","SE14",280.70999999999998,0,280.70999999999998,1,"(ni ZO)",243.82,null,"(ni ZO)",2.7599999999999909]
[null,"3.1. INT Sončne elektrarne - integrirane 2009","mikro - manjše od 50kW",null,477.78,0,477.78,0.88,477.78,445.32,null,0,2.4300000000000068]
[null,null,"mala - manjše od 1MW",null,437.02,0,437.02,0.88,437.02,404.56,null,0,2.4300000000000068]
[null,null,"srednja - od 1MW do vključno 10MW ",null,362.66,0,362.66,0.91,362.66,329.09,null,0,2.5099999999999909]
[null,null,"velika - nad 10MW do vključno 125MW",null,322.82,0,322.82,1,"(ni ZO)",285.93,null,"(ni ZO)",2.7599999999999909]
["SE21-2009","3.2 Sončne elektrarne - samostojni objekti 2009","mikro - manjše od 50kW","SE21",390.42,0,390.42,0.88,390.42,357.96,null,0,2.4300000000000068]
["SE22-2009",null,"mala - manjše od 1MW","SE22",359.71,0,359.71,0.88,359.71,327.25,null,0,2.4300000000000068]
["SE23-2009",null,"srednja - od 1MW do vključno 10MW ","SE23",289.98,0,289.98,0.91,289.98,256.41000000000003,null,0,2.5100000000000193]
["SE24-2009",null,"velika - nad 10MW do vključno 125MW","SE24",269.22000000000003,0,269.22000000000003,1,"(ni ZO)",232.33,null,"(ni ZO)",2.7600000000000193]
["SE11-2010","3.1 Sončne elektrarne - na stavbah 2010","mikro - manjše od 50kW","SE11",386.38,0,386.38,0.88,386.38,353.92,null,0,2.4300000000000068]
["SE12-2010",null,"mala - manjše od 1MW","SE12",353.42,0,353.42,0.88,353.42,320.95999999999998,null,0,2.4300000000000068]
["SE13-2010",null,"srednja - od 1MW do vključno 10MW ","SE13",293.27999999999997,0,293.27999999999997,0.91,293.27999999999997,259.70999999999998,null,0,2.5099999999999909]
["SE14-2010",null,"velika - nad 10MW do vključno 125MW","SE14",261.06,0,261.06,1,"(ni ZO)",224.17,null,"(ni ZO)",2.7599999999999909]
[null,"3.1 INT Sončne elektrarne - integrirane 2010","mikro - manjše od 50kW",null,444.34,0,444.34,0.88,444.34,411.88,null,0,2.4300000000000068]
[null,null,"mala - manjše od 1MW",null,406.43,0,406.43,0.88,406.43,373.97,null,0,2.4300000000000068]
[null,null,"srednja - od 1MW do vključno 10MW ",null,337.27,0,337.27,0.91,337.27,303.7,null,0,2.5099999999999909]
[null,null,"velika - nad 10MW do vključno 125MW",null,300.22000000000003,0,300.22000000000003,1,"(ni ZO)",263.33,null,"(ni ZO)",2.7599999999999909]
["SE21-2010","3.2 Sončne elektrarne - samostojni objekti 2010","mikro - manjše od 50kW","SE21",363.09,0,363.09,0.88,363.09,330.63,null,0,2.4300000000000068]
["SE22-2010",null,"mala - manjše od 1MW","SE22",334.53,0,334.53,0.88,334.53,302.07,null,0,2.4300000000000068]
["SE23-2010",null,"srednja - od 1MW do vključno 10MW ","SE23",269.68,0,269.68,0.91,269.68,236.11,null,0,2.5100000000000193]
["SE24-2010",null,"velika - nad 10MW do vključno 125MW","SE24",250.37,0,250.37,1,"(ni ZO)",213.48,null,"(ni ZO)",2.7599999999999909]
["SE11-2011","3.1 Sončne elektrarne - na stavbah 2011","mikro - manjše od 50kW","SE11",332.37,0,332.37,0.88,332.37,299.91000000000003,null,0,2.4300000000000068]
["SE12-2011",null,"mala - manjše od 1MW","SE12",304.02,0,304.02,0.88,304.02,271.56,null,0,2.4300000000000068]
["SE13-2011",null,"srednja - od 1MW do vključno 10MW ","SE13",252.29,0,252.29,0.91,252.29,218.72,null,0,2.5099999999999909]
["SE14-2011",null,"velika - nad 10MW do vključno 125MW","SE14",224.57,0,224.57,1,"(ni ZO)",187.68,null,"(ni ZO)",2.7600000000000193]
[null,"3.1 INT Sončne elektrarne - integrirane 2011","mikro - manjše od 50kW",null,382.23,0,382.23,0.88,382.23,349.77,null,0,2.4300000000000068]
[null,null,"mala - manjše od 1MW",null,349.62,0,349.62,0.88,349.62,317.16000000000003,null,0,2.4300000000000068]
[null,null,"srednja - od 1MW do vključno 10MW ",null,290.13,0,290.13,0.91,290.13,256.56,null,0,2.5099999999999909]
[null,null,"velika - nad 10MW do vključno 125MW",null,258.26,0,258.26,1,"(ni ZO)",221.37,null,"(ni ZO)",2.7599999999999909]
["SE21-2011","3.2 Sončne elektrarne - samostojni objekti 2011","mikro - manjše od 50kW","SE21",312.33999999999997,0,312.33999999999997,0.88,312.33999999999997,279.88,null,0,2.4300000000000068]
["SE22-2011",null,"mala - manjše od 1MW","SE22",287.77,0,287.77,0.88,287.77,255.31,null,0,2.4300000000000068]
["SE23-2011",null,"srednja - od 1MW do vključno 10MW ","SE23",231.98,0,231.98,0.91,231.98,198.41,null,0,2.5099999999999909]
["SE24-2011",null,"velika - nad 10MW do vključno 125MW","SE24",215.38,0,215.38,1,"(ni ZO)",178.49,null,"(ni ZO)",2.7600000000000193]
["SE11-2012H1","3.1 Sončne elektrarne - na stavbah 2012 H1","mikro - manjše od 50kW","SE11",290.82,0,290.82,0.88,290.82,258.36,null,0,2.4300000000000068]
["SE12-2012H1",null,"mala - manjše od 1MW","SE12",266.01,0,266.01,0.88,266.01,233.55,null,0,2.4300000000000068]
["SE13-2012H1",null,"srednja - od 1MW do vključno 10MW ","SE13",220.75,0,220.75,0.91,220.75,187.18,null,0,2.5100000000000193]
["SE14-2012H1",null,"velika - nad 10MW do vključno 125MW","SE14",196.5,0,196.5,1,"(ni ZO)",159.61000000000001,null,"(ni ZO)",2.7600000000000193]
["SE11-2012H2","3.1 Sončne elektrarne - na stavbah 2012 H2","mikro - manjše od 50kW","SE11",197.55,0,197.55,0.88,197.55,165.09,null,0,2.4300000000000068]
["SE12-2012H2",null,"mala - manjše od 1MW","SE12",180.7,0,180.7,0.88,180.7,148.24,null,0,2.4300000000000068]
["SE13-2012H2",null,"srednja - od 1MW do vključno 10MW ","SE13",149.94999999999999,0,149.94999999999999,0.91,149.94999999999999,116.38,null,0,2.5099999999999909]
["SE14-2012H2",null,"velika - nad 10MW do vključno 125MW","SE14",133.47999999999999,0,133.47999999999999,1,"(ni ZO)",96.59,null,"(ni ZO)",2.7600000000000051]
["SE21-2012H1","3.2 Sončne elektrarne - ostale 2012 H1","mikro - manjše od 50kW","SE21",273.29000000000002,0,273.29000000000002,0.88,273.29000000000002,240.83,null,0,2.4300000000000068]
["SE22-2012H1",null,"mala - manjše od 1MW","SE22",251.8,0,251.8,0.88,251.8,219.34,null,0,2.4300000000000068]
["SE23-2012H1",null,"srednja - od 1MW do vključno 10MW ","SE23",202.99,0,202.99,0.91,202.99,169.42,null,0,2.5099999999999909]
["SE24-2012H1",null,"velika - nad 10MW do vključno 125MW","SE24",188.45,0,188.45,1,"(ni ZO)",151.56,null,"(ni ZO)",2.7599999999999909]
["SE21-2012H2","3.2 Sončne elektrarne - ostale 2012 H2","mikro - manjše od 50kW","SE21",185.64,0,185.64,0.88,185.64,153.18,null,0,2.4300000000000068]
["SE22-2012H2",null,"mala - manjše od 1MW","SE22",171.04,0,171.04,0.88,171.04,138.58000000000001,null,0,2.4300000000000068]
["SE23-2012H2",null,"srednja - od 1MW do vključno 10MW ","SE23",137.88999999999999,0,137.88999999999999,0.91,137.88999999999999,104.32,null,0,2.5099999999999909]
["SE24-2012H2",null,"velika - nad 10MW do vključno 125MW","SE24",128.01,0,128.01,1,"(ni ZO)",91.12,null,"(ni ZO)",2.7600000000000051]
["SE11-2012dec",{"$f":"CONCATENATE(\"3.1 Sončne elektrarne - na stavbah\",\" \",RIGHT(A64,7))","v":"3.1 Sončne elektrarne - na stavbah 2012dec"},"mikro - manjše od 50kW","SE11",150,0,150,0.88,150,117.54,null,0,2.4300000000000068]
["SE12-2012dec",null,"mala - manjše od 1MW","SE12",137.19,0,137.19,0.88,137.19,104.73,null,0,2.4300000000000068]
["SE13-2012dec",null,"srednja - od 1MW do vključno 10MW ","SE13",113.85,0,113.85,0.91,113.85,80.28,null,0,2.5100000000000051]
["SE14-2012dec",null,"velika - nad 10MW do vključno 125MW","SE14",101.34,0,101.34,1,"(ni ZO)",64.45,null,"(ni ZO)",2.7600000000000051]
["SE21-2012dec",{"$f":"CONCATENATE(\"3.2 Sončne elektrarne - ostale\",\" \",RIGHT(A68,7))","v":"3.2 Sončne elektrarne - ostale 2012dec"},"mikro - manjše od 50kW","SE21",140.94999999999999,0,140.94999999999999,0.88,140.94999999999999,108.49,null,0,2.4299999999999926]
["SE22-2012dec",null,"mala - manjše od 1MW","SE22",129.86000000000001,0,129.86000000000001,0.88,129.86000000000001,97.4,null,0,2.4300000000000068]
["SE23-2012dec",null,"srednja - od 1MW do vključno 10MW ","SE23",104.68,0,104.68,0.91,104.68,71.11,null,0,2.5100000000000051]
["SE24-2012dec",null,"velika - nad 10MW do vključno 125MW","SE24",97.19,0,97.19,1,"(ni ZO)",60.3,null,"(ni ZO)",2.759999999999998]
["SE11-2013jan",{"$f":"CONCATENATE(\"3.1 Sončne elektrarne - na stavbah\",\" \",RIGHT(A72,7))","v":"3.1 Sončne elektrarne - na stavbah 2013jan"},"mikro - manjše od 50kW","SE11",147,0,147,0.88,147,114.54,null,0,2.4300000000000068]
["SE12-2013jan",null,"mala - manjše od 1MW","SE12",134.44999999999999,0,134.44999999999999,0.88,134.44999999999999,101.99,null,0,2.4299999999999926]
["SE13-2013jan",null,"srednja - od 1MW do vključno 10MW ","SE13",111.57,0,111.57,0.91,111.57,78,null,0,2.5100000000000051]
["SE14-2013jan",null,"velika - nad 10MW do vključno 125MW","SE14",99.31,0,99.31,1,"(ni ZO)",62.42,null,"(ni ZO)",2.7600000000000051]
["SE21-2013jan",{"$f":"CONCATENATE(\"3.2 Sončne elektrarne - ostale\",\" \",RIGHT(A76,7))","v":"3.2 Sončne elektrarne - ostale 2013jan"},"mikro - manjše od 50kW","SE21",138.13,0,138.13,0.88,138.13,105.67,null,0,2.4300000000000068]
["SE22-2013jan",null,"mala - manjše od 1MW","SE22",127.26,0,127.26,0.88,127.26,94.8,null,0,2.4299999999999926]
["SE23-2013jan",null,"srednja - od 1MW do vključno 10MW ","SE23",102.59,0,102.59,0.91,102.59,69.02,null,0,2.5099999999999909]
["SE24-2013jan",null,"velika - nad 10MW do vključno 125MW","SE24",95.25,0,95.25,1,"(ni ZO)",58.36,null,"(ni ZO)",2.759999999999998]
["SE11-2013feb",{"$f":"CONCATENATE(\"3.1 Sončne elektrarne - na stavbah\",\" \",RIGHT(A80,7))","v":"3.1 Sončne elektrarne - na stavbah 2013feb"},"mikro - manjše od 50kW","SE11",144.06,0,144.06,0.88,144.06,111.6,null,0,2.4299999999999926]
["SE12-2013feb",null,"mala - manjše od 1MW","SE12",131.76,0,131.76,0.88,131.76,99.3,null,0,2.4299999999999926]
["SE13-2013feb",null,"srednja - od 1MW do vključno 10MW ","SE13",109.34,0,109.34,0.91,109.34,75.77,null,0,2.5099999999999909]
["SE14-2013feb",null,"velika - nad 10MW do vključno 125MW","SE14",97.32,0,97.32,1,"(ni ZO)",60.43,null,"(ni ZO)",2.759999999999998]
["SE21-2013feb",{"$f":"CONCATENATE(\"3.2 Sončne elektrarne - ostale\",\" \",RIGHT(A84,7))","v":"3.2 Sončne elektrarne - ostale 2013feb"},"mikro - manjše od 50kW","SE21",135.37,0,135.37,0.88,135.37,102.91,null,0,2.4299999999999926]
["SE22-2013feb",null,"mala - manjše od 1MW","SE22",124.71,0,124.71,0.88,124.71,92.25,null,0,2.4300000000000068]
["SE23-2013feb",null,"srednja - od 1MW do vključno 10MW ","SE23",100.54,0,100.54,0.91,100.54,66.97,null,0,2.5100000000000051]
["SE24-2013feb",null,"velika - nad 10MW do vključno 125MW","SE24",93.35,0,93.35,1,"(ni ZO)",56.46,null,"(ni ZO)",2.759999999999998]
["SE11-2013mar",{"$f":"CONCATENATE(\"3.1 Sončne elektrarne - na stavbah\",\" \",RIGHT(A88,7))","v":"3.1 Sončne elektrarne - na stavbah 2013mar"},"mikro - manjše od 50kW","SE11",141.18,0,141.18,0.88,141.18,108.72,null,0,2.4299999999999926]
["SE12-2013mar",null,"mala - manjše od 1MW","SE12",129.12,0,129.12,0.88,129.12,96.66,null,0,2.4299999999999926]
["SE13-2013mar",null,"srednja - od 1MW do vključno 10MW ","SE13",107.15,0,107.15,0.91,107.15,73.58,null,0,2.5100000000000051]
["SE14-2013mar",null,"velika - nad 10MW do vključno 125MW","SE14",95.37,0,95.37,1,"(ni ZO)",58.48,null,"(ni ZO)",2.759999999999998]
["SE21-2013mar",{"$f":"CONCATENATE(\"3.2 Sončne elektrarne - ostale\",\" \",RIGHT(A92,7))","v":"3.2 Sončne elektrarne - ostale 2013mar"},"mikro - manjše od 50kW","SE21",132.66,0,132.66,0.88,132.66,100.2,null,0,2.4300000000000068]
["SE22-2013mar",null,"mala - manjše od 1MW","SE22",122.22,0,122.22,0.88,122.22,89.76,null,0,2.4300000000000068]
["SE23-2013mar",null,"srednja - od 1MW do vključno 10MW ","SE23",98.53,0,98.53,0.91,98.53,64.959999999999994,null,0,2.5099999999999909]
["SE24-2013mar",null,"velika - nad 10MW do vključno 125MW","SE24",91.48,0,91.48,1,"(ni ZO)",54.59,null,"(ni ZO)",2.7600000000000051]
["SE11-2013apr",{"$f":"CONCATENATE(\"3.1 Sončne elektrarne - na stavbah\",\" \",RIGHT(A96,7))","v":"3.1 Sončne elektrarne - na stavbah 2013apr"},"mikro - manjše od 50kW","SE11",138.36000000000001,0,138.36000000000001,0.88,138.36000000000001,105.9,null,0,2.4300000000000068]
["SE12-2013apr",null,"mala - manjše od 1MW","SE12",126.54,0,126.54,0.88,126.54,94.08,null,0,2.4299999999999926]
["SE13-2013apr",null,"srednja - od 1MW do vključno 10MW ","SE13",105.01,0,105.01,0.91,105.01,71.44,null,0,2.5099999999999909]
["SE14-2013apr",null,"velika - nad 10MW do vključno 125MW","SE14",93.46,0,93.46,1,"(ni ZO)",56.57,null,"(ni ZO)",2.759999999999998]
["SE21-2013apr",{"$f":"CONCATENATE(\"3.2 Sončne elektrarne - ostale\",\" \",RIGHT(A100,7))","v":"3.2 Sončne elektrarne - ostale 2013apr"},"mikro - manjše od 50kW","SE21",130.01,0,130.01,0.88,130.01,97.55,null,0,2.4299999999999926]
["SE22-2013apr",null,"mala - manjše od 1MW","SE22",119.78,0,119.78,0.88,119.78,87.32,null,0,2.4299999999999926]
["SE23-2013apr",null,"srednja - od 1MW do vključno 10MW ","SE23",96.56,0,96.56,0.91,96.56,62.99,null,0,2.5100000000000051]
["SE24-2013apr",null,"velika - nad 10MW do vključno 125MW","SE24",89.65,0,89.65,1,"(ni ZO)",52.76,null,"(ni ZO)",2.759999999999998]
["SE11-2013maj",{"$f":"CONCATENATE(\"3.1 Sončne elektrarne - na stavbah\",\" \",RIGHT(A104,7))","v":"3.1 Sončne elektrarne - na stavbah 2013maj"},"mikro - manjše od 50kW","SE11",135.59,0,135.59,0.88,135.59,103.13,null,0,2.4299999999999926]
["SE12-2013maj",null,"mala - manjše od 1MW","SE12",124.01,0,124.01,0.88,124.01,91.55,null,0,2.4299999999999926]
["SE13-2013maj",null,"srednja - od 1MW do vključno 10MW ","SE13",102.91,0,102.91,0.91,102.91,69.34,null,0,2.5100000000000051]
["SE14-2013maj",null,"velika - nad 10MW do vključno 125MW","SE14",91.59,0,91.59,1,"(ni ZO)",54.7,null,"(ni ZO)",2.7600000000000051]
["SE21-2013maj",{"$f":"CONCATENATE(\"3.2 Sončne elektrarne - ostale\",\" \",RIGHT(A108,7))","v":"3.2 Sončne elektrarne - ostale 2013maj"},"mikro - manjše od 50kW","SE21",127.41,0,127.41,0.88,127.41,94.95,null,0,2.4300000000000068]
["SE22-2013maj",null,"mala - manjše od 1MW","SE22",117.38,0,117.38,0.88,117.38,84.92,null,0,2.4300000000000068]
["SE23-2013maj",null,"srednja - od 1MW do vključno 10MW ","SE23",94.63,0,94.63,0.91,94.63,61.06,null,0,2.5100000000000051]
["SE24-2013maj",null,"velika - nad 10MW do vključno 125MW","SE24",87.86,0,87.86,1,"(ni ZO)",50.97,null,"(ni ZO)",2.759999999999998]
["SE11-2013jun",{"$f":"CONCATENATE(\"3.1 Sončne elektrarne - na stavbah\",\" \",RIGHT(A112,7))","v":"3.1 Sončne elektrarne - na stavbah 2013jun"},"mikro - manjše od 50kW","SE11",132.88,0,132.88,0.88,132.88,100.42,null,0,2.4300000000000068]
["SE12-2013jun",null,"mala - manjše od 1MW","SE12",121.53,0,121.53,0.88,121.53,89.07,null,0,2.4299999999999926]
["SE13-2013jun",null,"srednja - od 1MW do vključno 10MW ","SE13",100.85,0,100.85,0.91,100.85,67.28,null,0,2.5100000000000051]
["SE14-2013jun",null,"velika - nad 10MW do vključno 125MW","SE14",89.76,0,89.76,1,"(ni ZO)",52.87,null,"(ni ZO)",2.759999999999998]
["SE21-2013jun",{"$f":"CONCATENATE(\"3.2 Sončne elektrarne - ostale\",\" \",RIGHT(A116,7))","v":"3.2 Sončne elektrarne - ostale 2013jun"},"mikro - manjše od 50kW","SE21",124.86,0,124.86,0.88,124.86,92.4,null,0,2.4300000000000068]
["SE22-2013jun",null,"mala - manjše od 1MW","SE22",115.03,0,115.03,0.88,115.03,82.57,null,0,2.4299999999999926]
["SE23-2013jun",null,"srednja - od 1MW do vključno 10MW ","SE23",92.74,0,92.74,0.91,92.74,59.17,null,0,2.5100000000000051]
["SE24-2013jun",null,"velika - nad 10MW do vključno 125MW","SE24",86.1,0,86.1,1,"(ni ZO)",49.21,null,"(ni ZO)",2.759999999999998]
["SE11-2013jul",{"$f":"CONCATENATE(\"3.1 Sončne elektrarne - na stavbah\",\" \",RIGHT(A120,7))","v":"3.1 Sončne elektrarne - na stavbah 2013jul"},"mikro - manjše od 50kW","SE11",130.22,0,130.22,0.88,130.22,97.76,null,0,2.4300000000000068]
["SE12-2013jul",null,"mala - manjše od 1MW","SE12",119.1,0,119.1,0.88,119.1,86.64,null,0,2.4300000000000068]
["SE13-2013jul",null,"srednja - od 1MW do vključno 10MW ","SE13",98.83,0,98.83,0.91,98.83,65.260000000000005,null,0,2.5100000000000051]
["SE14-2013jul",null,"velika - nad 10MW do vključno 125MW","SE14",87.96,0,87.96,1,"(ni ZO)",51.07,null,"(ni ZO)",2.759999999999998]
["SE21-2013jul",{"$f":"CONCATENATE(\"3.2 Sončne elektrarne - ostale\",\" \",RIGHT(A124,7))","v":"3.2 Sončne elektrarne - ostale 2013jul"},"mikro - manjše od 50kW","SE21",122.36,0,122.36,0.88,122.36,89.9,null,0,2.4300000000000068]
["SE22-2013jul",null,"mala - manjše od 1MW","SE22",112.73,0,112.73,0.88,112.73,80.27,null,0,2.4299999999999926]
["SE23-2013jul",null,"srednja - od 1MW do vključno 10MW ","SE23",90.89,0,90.89,0.91,90.89,57.32,null,0,2.509999999999998]
["SE24-2013jul",null,"velika - nad 10MW do vključno 125MW","SE24",84.38,0,84.38,1,"(ni ZO)",47.49,null,"(ni ZO)",2.7600000000000051]
["SE11-2013avg",{"$f":"CONCATENATE(\"3.1 Sončne elektrarne - na stavbah\",\" \",RIGHT(A128,7))","v":"3.1 Sončne elektrarne - na stavbah 2013avg"},"mikro - manjše od 50kW","SE11",127.62,0,127.62,0.88,127.62,95.16,null,0,2.4299999999999926]
["SE12-2013avg",null,"mala - manjše od 1MW","SE12",116.72,0,116.72,0.88,116.72,84.26,null,0,2.4300000000000068]
["SE13-2013avg",null,"srednja - od 1MW do vključno 10MW ","SE13",96.85,0,96.85,0.91,96.85,63.28,null,0,2.509999999999998]
["SE14-2013avg",null,"velika - nad 10MW do vključno 125MW","SE14",86.2,0,86.2,1,"(ni ZO)",49.31,null,"(ni ZO)",2.7600000000000051]
["SE21-2013avg",{"$f":"CONCATENATE(\"3.2 Sončne elektrarne - ostale\",\" \",RIGHT(A132,7))","v":"3.2 Sončne elektrarne - ostale 2013avg"},"mikro - manjše od 50kW","SE21",119.91,0,119.91,0.88,119.91,87.45,null,0,2.4300000000000068]
["SE22-2013avg",null,"mala - manjše od 1MW","SE22",110.48,0,110.48,0.88,110.48,78.02,null,0,2.4299999999999926]
["SE23-2013avg",null,"srednja - od 1MW do vključno 10MW ","SE23",89.07,0,89.07,0.91,89.07,55.5,null,0,2.509999999999998]
["SE24-2013avg",null,"velika - nad 10MW do vključno 125MW","SE24",82.69,0,82.69,1,"(ni ZO)",45.8,null,"(ni ZO)",2.759999999999998]
["SE11-2013sep",{"$f":"CONCATENATE(\"3.1 Sončne elektrarne - na stavbah\",\" \",RIGHT(A136,7))","v":"3.1 Sončne elektrarne - na stavbah 2013sep"},"mikro - manjše od 50kW","SE11",125.07,0,125.07,0.88,125.07,92.61,null,0,2.4299999999999926]
["SE12-2013sep",null,"mala - manjše od 1MW","SE12",114.39,0,114.39,0.88,114.39,81.93,null,0,2.4300000000000068]
["SE13-2013sep",null,"srednja - od 1MW do vključno 10MW ","SE13",94.91,0,94.91,0.91,94.91,61.34,null,0,2.5100000000000051]
["SE14-2013sep",null,"velika - nad 10MW do vključno 125MW","SE14",84.48,0,84.48,1,"(ni ZO)",47.59,null,"(ni ZO)",2.7600000000000051]
["SE21-2013sep",{"$f":"CONCATENATE(\"3.2 Sončne elektrarne - ostale\",\" \",RIGHT(A140,7))","v":"3.2 Sončne elektrarne - ostale 2013sep"},"mikro - manjše od 50kW","SE21",117.51,0,117.51,0.88,117.51,85.05,null,0,2.4299999999999926]
["SE22-2013sep",null,"mala - manjše od 1MW","SE22",108.27,0,108.27,0.88,108.27,75.81,null,0,2.4300000000000068]
["SE23-2013sep",null,"srednja - od 1MW do vključno 10MW ","SE23",87.29,0,87.29,0.91,87.29,53.72,null,0,2.509999999999998]
["SE24-2013sep",null,"velika - nad 10MW do vključno 125MW","SE24",81.040000000000006,0,81.040000000000006,1,"(ni ZO)",44.15,null,"(ni ZO)",2.759999999999998]
["SE11-2013okt",{"$f":"CONCATENATE(\"3.1 Sončne elektrarne - na stavbah\",\" \",RIGHT(A144,7))","v":"3.1 Sončne elektrarne - na stavbah 2013okt"},"mikro - manjše od 50kW","SE11",122.57,0,122.57,0.88,122.57,90.11,null,0,2.4299999999999926]
["SE12-2013okt",null,"mala - manjše od 1MW","SE12",112.1,0,112.1,0.88,112.1,79.64,null,0,2.4300000000000068]
["SE13-2013okt",null,"srednja - od 1MW do vključno 10MW ","SE13",93.01,0,93.01,0.91,93.01,59.44,null,0,2.509999999999998]
["SE14-2013okt",null,"velika - nad 10MW do vključno 125MW","SE14",82.79,0,82.79,1,"(ni ZO)",45.9,null,"(ni ZO)",2.759999999999998]
["SE21-2013okt",{"$f":"CONCATENATE(\"3.2 Sončne elektrarne - ostale\",\" \",RIGHT(A148,7))","v":"3.2 Sončne elektrarne - ostale 2013okt"},"mikro - manjše od 50kW","SE21",115.16,0,115.16,0.88,115.16,82.7,null,0,2.4300000000000068]
["SE22-2013okt",null,"mala - manjše od 1MW","SE22",106.1,0,106.1,0.88,106.1,73.64,null,0,2.4300000000000068]
["SE23-2013okt",null,"srednja - od 1MW do vključno 10MW ","SE23",85.54,0,85.54,0.91,85.54,51.97,null,0,2.509999999999998]
["SE24-2013okt",null,"velika - nad 10MW do vključno 125MW","SE24",79.42,0,79.42,1,"(ni ZO)",42.53,null,"(ni ZO)",2.759999999999998]
["SE11-2013nov",{"$f":"CONCATENATE(\"3.1 Sončne elektrarne - na stavbah\",\" \",RIGHT(A152,7))","v":"3.1 Sončne elektrarne - na stavbah 2013nov"},"mikro - manjše od 50kW","SE11",120.12,0,120.12,0.88,120.12,87.66,null,0,2.4299999999999926]
["SE12-2013nov",null,"mala - manjše od 1MW","SE12",109.86,0,109.86,0.88,109.86,77.400000000000006,null,0,2.4300000000000068]
["SE13-2013nov",null,"srednja - od 1MW do vključno 10MW ","SE13",91.15,0,91.15,0.91,91.15,57.58,null,0,2.509999999999998]
["SE14-2013nov",null,"velika - nad 10MW do vključno 125MW","SE14",81.13,0,81.13,1,"(ni ZO)",44.24,null,"(ni ZO)",2.7600000000000051]
["SE21-2013nov",{"$f":"CONCATENATE(\"3.2 Sončne elektrarne - ostale\",\" \",RIGHT(A156,7))","v":"3.2 Sončne elektrarne - ostale 2013nov"},"mikro - manjše od 50kW","SE21",112.86,0,112.86,0.88,112.86,80.400000000000006,null,0,2.4300000000000068]
["SE22-2013nov",null,"mala - manjše od 1MW","SE22",103.98,0,103.98,0.88,103.98,71.52,null,0,2.4299999999999926]
["SE23-2013nov",null,"srednja - od 1MW do vključno 10MW ","SE23",83.83,0,83.83,0.91,83.83,50.26,null,0,2.509999999999998]
["SE24-2013nov",null,"velika - nad 10MW do vključno 125MW","SE24",77.83,0,77.83,1,"(ni ZO)",40.94,null,"(ni ZO)",2.759999999999998]
["SE11-2013dec",{"$f":"CONCATENATE(\"3.1 Sončne elektrarne - na stavbah\",\" \",RIGHT(A160,7))","v":"3.1 Sončne elektrarne - na stavbah 2013dec"},"mikro - manjše od 50kW","SE11",117.72,0,117.72,0.88,117.72,85.26,null,0,2.4300000000000068]
["SE12-2013dec",null,"mala - manjše od 1MW","SE12",107.66,0,107.66,0.88,107.66,75.2,null,0,2.4300000000000068]
["SE13-2013dec",null,"srednja - od 1MW do vključno 10MW ","SE13",89.33,0,89.33,0.91,89.33,55.76,null,0,2.509999999999998]
["SE14-2013dec",null,"velika - nad 10MW do vključno 125MW","SE14",79.510000000000005,0,79.510000000000005,1,"(ni ZO)",42.62,null,"(ni ZO)",2.759999999999998]
["SE21-2013dec",{"$f":"CONCATENATE(\"3.2 Sončne elektrarne - ostale\",\" \",RIGHT(A164,7))","v":"3.2 Sončne elektrarne - ostale 2013dec"},"mikro - manjše od 50kW","SE21",110.6,0,110.6,0.88,110.6,78.14,null,0,2.4300000000000068]
["SE22-2013dec",null,"mala - manjše od 1MW","SE22",101.9,0,101.9,0.88,101.9,69.44,null,0,2.4299999999999926]
["SE23-2013dec",null,"srednja - od 1MW do vključno 10MW ","SE23",82.15,0,82.15,0.91,82.15,48.58,null,0,2.509999999999998]
["SE24-2013dec",null,"velika - nad 10MW do vključno 125MW","SE24",76.27,0,76.27,1,"(ni ZO)",39.380000000000003,null,"(ni ZO)",2.7600000000000051]
["SE11-2014jan",{"$f":"CONCATENATE(\"3.1 Sončne elektrarne - na stavbah\",\" \",RIGHT(A168,7))","v":"3.1 Sončne elektrarne - na stavbah 2014jan"},"mikro - manjše od 50kW","SE11",115.37,0,115.37,0.88,115.37,82.91,null,0,2.4299999999999926]
["SE12-2014jan",null,"mala - manjše od 1MW","SE12",105.51,0,105.51,0.88,105.51,73.05,null,0,2.4299999999999926]
["SE13-2014jan",null,"srednja - od 1MW do vključno 10MW ","SE13",87.54,0,87.54,0.91,87.54,53.97,null,0,2.509999999999998]
["SE14-2014jan",null,"velika - nad 10MW do vključno 125MW","SE14",77.92,0,77.92,1,"(ni ZO)",41.03,null,"(ni ZO)",2.759999999999998]
["SE21-2014jan",{"$f":"CONCATENATE(\"3.2 Sončne elektrarne - ostale\",\" \",RIGHT(A172,7))","v":"3.2 Sončne elektrarne - ostale 2014jan"},"mikro - manjše od 50kW","SE21",108.39,0,108.39,0.88,108.39,75.930000000000007,null,0,2.4300000000000068]
["SE22-2014jan",null,"mala - manjše od 1MW","SE22",99.86,0,99.86,0.88,99.86,67.400000000000006,null,0,2.4300000000000068]
["SE23-2014jan",null,"srednja - od 1MW do vključno 10MW ","SE23",80.510000000000005,0,80.510000000000005,0.91,80.510000000000005,46.94,null,0,2.509999999999998]
["SE24-2014jan",null,"velika - nad 10MW do vključno 125MW","SE24",74.739999999999995,0,74.739999999999995,1,"(ni ZO)",37.85,null,"(ni ZO)",2.759999999999998]
["SE11-2014feb",{"$f":"CONCATENATE(\"3.1 Sončne elektrarne - na stavbah\",\" \",RIGHT(A176,7))","v":"3.1 Sončne elektrarne - na stavbah 2014feb"},"mikro - manjše od 50kW","SE11",113.06,0,113.06,0.88,113.06,80.599999999999994,null,0,2.4299999999999926]
["SE12-2014feb",null,"mala - manjše od 1MW","SE12",103.4,0,103.4,0.88,103.4,70.94,null,0,2.4299999999999926]
["SE13-2014feb",null,"srednja - od 1MW do vključno 10MW ","SE13",85.79,0,85.79,0.91,85.79,52.22,null,0,2.509999999999998]
["SE14-2014feb",null,"velika - nad 10MW do vključno 125MW","SE14",76.36,0,76.36,1,"(ni ZO)",39.47,null,"(ni ZO)",2.759999999999998]
["SE21-2014feb",{"$f":"CONCATENATE(\"3.2 Sončne elektrarne - ostale\",\" \",RIGHT(A180,7))","v":"3.2 Sončne elektrarne - ostale 2014feb"},"mikro - manjše od 50kW","SE21",106.22,0,106.22,0.88,106.22,73.760000000000005,null,0,2.4300000000000068]
["SE22-2014feb",null,"mala - manjše od 1MW","SE22",97.86,0,97.86,0.88,97.86,65.400000000000006,null,0,2.4300000000000068]
["SE23-2014feb",null,"srednja - od 1MW do vključno 10MW ","SE23",78.900000000000006,0,78.900000000000006,0.91,78.900000000000006,45.33,null,0,2.509999999999998]
["SE24-2014feb",null,"velika - nad 10MW do vključno 125MW","SE24",73.25,0,73.25,1,"(ni ZO)",36.36,null,"(ni ZO)",2.759999999999998]
["SE11-2014mar",{"$f":"CONCATENATE(\"3.1 Sončne elektrarne - na stavbah\",\" \",RIGHT(A184,7))","v":"3.1 Sončne elektrarne - na stavbah 2014mar"},"mikro - manjše od 50kW","SE11",110.8,0,110.8,0.88,110.8,78.34,null,0,2.4300000000000068]
["SE12-2014mar",null,"mala - manjše od 1MW","SE12",101.33,0,101.33,0.88,101.33,68.87,null,0,2.4300000000000068]
["SE13-2014mar",null,"srednja - od 1MW do vključno 10MW ","SE13",84.07,0,84.07,0.91,84.07,50.5,null,0,2.509999999999998]
["SE14-2014mar",null,"velika - nad 10MW do vključno 125MW","SE14",74.83,0,74.83,1,"(ni ZO)",37.94,null,"(ni ZO)",2.759999999999998]
["SE21-2014mar",{"$f":"CONCATENATE(\"3.2 Sončne elektrarne - ostale\",\" \",RIGHT(A188,7))","v":"3.2 Sončne elektrarne - ostale 2014mar"},"mikro - manjše od 50kW","SE21",104.1,0,104.1,0.88,104.1,71.64,null,0,2.4300000000000068]
["SE22-2014mar",null,"mala - manjše od 1MW","SE22",95.9,0,95.9,0.88,95.9,63.44,null,0,2.4299999999999997]
["SE23-2014mar",null,"srednja - od 1MW do vključno 10MW ","SE23",77.319999999999993,0,77.319999999999993,0.91,77.319999999999993,43.75,null,0,2.509999999999998]
["SE24-2014mar",null,"velika - nad 10MW do vključno 125MW","SE24",71.790000000000006,0,71.790000000000006,1,"(ni ZO)",34.9,null,"(ni ZO)",2.759999999999998]
["SE11-2014apr",{"$f":"CONCATENATE(\"3.1 Sončne elektrarne - na stavbah\",\" \",RIGHT(A192,7))","v":"3.1 Sončne elektrarne - na stavbah 2014apr"},"mikro - manjše od 50kW","SE11",108.58,0,108.58,0.88,108.58,76.12,null,0,2.4300000000000068]
["SE12-2014apr",null,"mala - manjše od 1MW","SE12",99.3,0,99.3,0.88,99.3,66.84,null,0,2.4300000000000068]
["SE13-2014apr",null,"srednja - od 1MW do vključno 10MW ","SE13",82.39,0,82.39,0.91,82.39,48.82,null,0,2.509999999999998]
["SE14-2014apr",null,"velika - nad 10MW do vključno 125MW","SE14",73.33,0,73.33,1,"(ni ZO)",36.44,null,"(ni ZO)",2.759999999999998]
["SE21-2014apr",{"$f":"CONCATENATE(\"3.2 Sončne elektrarne - ostale\",\" \",RIGHT(A196,7))","v":"3.2 Sončne elektrarne - ostale 2014apr"},"mikro - manjše od 50kW","SE21",102.02,0,102.02,0.88,102.02,69.56,null,0,2.4300000000000068]
["SE22-2014apr",null,"mala - manjše od 1MW","SE22",93.98,0,93.98,0.88,93.98,61.52,null,0,2.4299999999999997]
["SE23-2014apr",null,"srednja - od 1MW do vključno 10MW ","SE23",75.77,0,75.77,0.91,75.77,42.2,null,0,2.5100000000000051]
["SE24-2014apr",null,"velika - nad 10MW do vključno 125MW","SE24",70.349999999999994,0,70.349999999999994,1,"(ni ZO)",33.46,null,"(ni ZO)",2.7600000000000016]
["SE11-2014maj",{"$f":"CONCATENATE(\"3.1 Sončne elektrarne - na stavbah\",\" \",RIGHT(A200,7))","v":"3.1 Sončne elektrarne - na stavbah 2014maj"},"mikro - manjše od 50kW","SE11",106.41,0,106.41,0.88,106.41,73.95,null,0,2.4300000000000068]
["SE12-2014maj",null,"mala - manjše od 1MW","SE12",97.31,0,97.31,0.88,97.31,64.849999999999994,null,0,2.4299999999999926]
["SE13-2014maj",null,"srednja - od 1MW do vključno 10MW ","SE13",80.739999999999995,0,80.739999999999995,0.91,80.739999999999995,47.17,null,0,2.5100000000000051]
["SE14-2014maj",null,"velika - nad 10MW do vključno 125MW","SE14",71.86,0,71.86,1,"(ni ZO)",34.97,null,"(ni ZO)",2.759999999999998]
["SE21-2014maj",{"$f":"CONCATENATE(\"3.2 Sončne elektrarne - ostale\",\" \",RIGHT(A204,7))","v":"3.2 Sončne elektrarne - ostale 2014maj"},"mikro - manjše od 50kW","SE21",99.98,0,99.98,0.88,99.98,67.52,null,0,2.4299999999999926]
["SE22-2014maj",null,"mala - manjše od 1MW","SE22",92.1,0,92.1,0.88,92.1,59.64,null,0,2.4299999999999997]
["SE23-2014maj",null,"srednja - od 1MW do vključno 10MW ","SE23",74.25,0,74.25,0.91,74.25,40.68,null,0,2.509999999999998]
["SE24-2014maj",null,"velika - nad 10MW do vključno 125MW","SE24",68.94,0,68.94,1,"(ni ZO)",32.049999999999997,null,"(ni ZO)",2.759999999999998]
["SE11-2014jun",{"$f":"CONCATENATE(\"3.1 Sončne elektrarne - na stavbah\",\" \",RIGHT(A208,7))","v":"3.1 Sončne elektrarne - na stavbah 2014jun"},"mikro - manjše od 50kW","SE11",104.28,0,104.28,0.88,104.28,71.819999999999993,null,0,2.4299999999999926]
["SE12-2014jun",null,"mala - manjše od 1MW","SE12",95.36,0,95.36,0.88,95.36,62.9,null,0,2.4299999999999997]
["SE13-2014jun",null,"srednja - od 1MW do vključno 10MW ","SE13",79.13,0,79.13,0.91,79.13,45.56,null,0,2.5100000000000051]
["SE14-2014jun",null,"velika - nad 10MW do vključno 125MW","SE14",70.42,0,70.42,1,"(ni ZO)",33.53,null,"(ni ZO)",2.7600000000000016]
["SE21-2014jun",{"$f":"CONCATENATE(\"3.2 Sončne elektrarne - ostale\",\" \",RIGHT(A212,7))","v":"3.2 Sončne elektrarne - ostale 2014jun"},"mikro - manjše od 50kW","SE21",97.98,0,97.98,0.88,97.98,65.52,null,0,2.4299999999999926]
["SE22-2014jun",null,"mala - manjše od 1MW","SE22",90.26,0,90.26,0.88,90.26,57.8,null,0,2.4299999999999997]
["SE23-2014jun",null,"srednja - od 1MW do vključno 10MW ","SE23",72.77,0,72.77,0.91,72.77,39.200000000000003,null,0,2.5100000000000051]
["SE24-2014jun",null,"velika - nad 10MW do vključno 125MW","SE24",67.56,0,67.56,1,"(ni ZO)",30.67,null,"(ni ZO)",2.7600000000000016]
["SE11-2014jul",{"$f":"CONCATENATE(\"3.1 Sončne elektrarne - na stavbah\",\" \",RIGHT(A216,7))","v":"3.1 Sončne elektrarne - na stavbah 2014jul"},"mikro - manjše od 50kW","SE11",102.19,0,102.19,0.88,102.19,69.73,null,0,2.4300000000000068]
["SE12-2014jul",null,"mala - manjše od 1MW","SE12",93.45,0,93.45,0.88,93.45,60.99,null,0,2.4299999999999997]
["SE13-2014jul",null,"srednja - od 1MW do vključno 10MW ","SE13",77.55,0,77.55,0.91,77.55,43.98,null,0,2.509999999999998]
["SE14-2014jul",null,"velika - nad 10MW do vključno 125MW","SE14",69.010000000000005,0,69.010000000000005,1,"(ni ZO)",32.119999999999997,null,"(ni ZO)",2.759999999999998]
["SE21-2014jul",{"$f":"CONCATENATE(\"3.2 Sončne elektrarne - ostale\",\" \",RIGHT(A220,7))","v":"3.2 Sončne elektrarne - ostale 2014jul"},"mikro - manjše od 50kW","SE21",96.02,0,96.02,0.88,96.02,63.56,null,0,2.4299999999999997]
["SE22-2014jul",null,"mala - manjše od 1MW","SE22",88.45,0,88.45,0.88,88.45,55.99,null,0,2.4299999999999997]
["SE23-2014jul",null,"srednja - od 1MW do vključno 10MW ","SE23",71.31,0,71.31,0.91,71.31,37.74,null,0,2.5100000000000051]
["SE24-2014jul",null,"velika - nad 10MW do vključno 125MW","SE24",66.209999999999994,0,66.209999999999994,1,"(ni ZO)",29.32,null,"(ni ZO)",2.7600000000000016]
["SE11-2014avg",{"$f":"CONCATENATE(\"3.1 Sončne elektrarne - na stavbah\",\" \",RIGHT(A224,7))","v":"3.1 Sončne elektrarne - na stavbah 2014avg"},"mikro - manjše od 50kW","SE11",100.15,0,100.15,0.88,100.15,67.69,null,0,2.4299999999999926]
["SE12-2014avg",null,"mala - manjše od 1MW","SE12",91.58,0,91.58,0.88,91.58,59.12,null,0,2.4299999999999997]
["SE13-2014avg",null,"srednja - od 1MW do vključno 10MW ","SE13",76,0,76,0.91,76,42.43,null,0,2.509999999999998]
["SE14-2014avg",null,"velika - nad 10MW do vključno 125MW","SE14",67.63,0,67.63,1,"(ni ZO)",30.74,null,"(ni ZO)",2.759999999999998]
["SE21-2014avg",{"$f":"CONCATENATE(\"3.2 Sončne elektrarne - ostale\",\" \",RIGHT(A228,7))","v":"3.2 Sončne elektrarne - ostale 2014avg"},"mikro - manjše od 50kW","SE21",94.1,0,94.1,0.88,94.1,61.64,null,0,2.4299999999999997]
["SE22-2014avg",null,"mala - manjše od 1MW","SE22",86.68,0,86.68,0.88,86.68,54.22,null,0,2.4299999999999997]
["SE23-2014avg",null,"srednja - od 1MW do vključno 10MW ","SE23",69.88,0,69.88,0.91,69.88,36.31,null,0,2.5100000000000051]
["SE24-2014avg",null,"velika - nad 10MW do vključno 125MW","SE24",64.89,0,64.89,1,"(ni ZO)",28,null,"(ni ZO)",2.7600000000000016]
["SE11-2014sep",{"$f":"CONCATENATE(\"3.1 Sončne elektrarne - na stavbah\",\" \",RIGHT(A232,7))","v":"3.1 Sončne elektrarne - na stavbah 2014sep"},"mikro - manjše od 50kW","SE11",98.15,0,98.15,0.88,98.15,65.69,null,0,2.4299999999999997]
["SE12-2014sep",null,"mala - manjše od 1MW","SE12",89.75,0,89.75,0.88,89.75,57.29,null,0,2.4299999999999997]
["SE13-2014sep",null,"srednja - od 1MW do vključno 10MW ","SE13",74.48,0,74.48,0.91,74.48,40.909999999999997,null,0,2.509999999999998]
["SE14-2014sep",null,"velika - nad 10MW do vključno 125MW","SE14",66.28,0,66.28,1,"(ni ZO)",29.39,null,"(ni ZO)",2.7600000000000016]
["SE21-2014sep",{"$f":"CONCATENATE(\"3.2 Sončne elektrarne - ostale\",\" \",RIGHT(A236,7))","v":"3.2 Sončne elektrarne - ostale 2014sep"},"mikro - manjše od 50kW","SE21",92.22,0,92.22,0.88,92.22,59.76,null,0,2.4299999999999997]
["SE22-2014sep",null,"mala - manjše od 1MW","SE22",84.95,0,84.95,0.88,84.95,52.49,null,0,2.4299999999999997]
["SE23-2014sep",null,"srednja - od 1MW do vključno 10MW ","SE23",68.48,0,68.48,0.91,68.48,34.909999999999997,null,0,2.509999999999998]
["SE24-2014sep",null,"velika - nad 10MW do vključno 125MW","SE24",63.59,0,63.59,1,"(ni ZO)",26.7,null,"(ni ZO)",2.759999999999998]
["GT01","4. Geotermalne elektrarne","mikro - manjše od 50kW","GT01",152.47,0,152.47,0.92,152.47,118.53,null,0,2.5400000000000063]
["GT02",null,"mala - manjše od 1MW","GT02",152.47,0,152.47,0.92,152.47,118.53,null,0,2.5400000000000063]
["GT03",null,"srednja - od 1MW do vključno 10MW ","GT03",152.47,0,152.47,0.92,152.47,118.53,null,0,2.5400000000000063]
["GT04",null,"velika - nad 10MW do vključno 125MW","GT04","(indvid.)",0,"(indvid.)",0.92,"(ni ZO)","(indvid.)",null,"(ni ZO; individ.)","(individ.)"]
["LB11","5.1 Elektrarne na lesno biomaso","mikro - manjše od 50kW","LB11","(indvid.)","(indvid.)","(indvid.)",0.88,"(indvid.)","(indvid.)",null,"(individ.)","(individ.)"]
["LB12",null,"mala - manjše od 1MW","LB12",161.94999999999999,81.86,243.81,0.91,243.81,210.24,null,-6.6299999999999955,-4.1200000000000045]
["LB13",null,"srednja - od 1MW do vključno 10MW ","LB13",115.52,68.11,183.63,0.92,183.63,149.69,null,-5.5199999999999818,-2.9799999999999898]
["LB14",null,"velika - nad 10MW do vključno 125MW","LB14","(indvid.)","(indvid.)","(indvid.)",0.92,"(ni ZO)","(indvid.)",null,"(ni ZO; individ.)","(individ.)"]
["LB21","5.2.Sosežig lesne biomase >5%","mikro - manjše od 50kW","LB21",51.34,67.17,118.51,0.88,"(ni ZO)",86.05,null,"(ni ZO)",-3.0100000000000051]
["LB22",null,"mala - manjše od 1MW","LB22",51.34,67.17,118.51,0.91,"(ni ZO)",84.94,null,"(ni ZO)",-2.9300000000000068]
["LB23",null,"srednja - od 1MW do vključno 10MW ","LB23",51.34,67.17,118.51,0.92,"(ni ZO)",84.57,null,"(ni ZO)",-2.9000000000000057]
["LB24",null,"velika - nad 10MW do vključno 125MW","LB24","(indvid.)","(indvid.)","(indvid.)",0.92,"(ni ZO)","(indvid.)",null,"(ni ZO; individ.)","(individ.)"]
["LB31","5.3.Sosežig lesne biomase <5%","mikro - manjše od 50kW","LB31",0,59.28,59.28,"OP=SDRS","(ni ZO)",59.28,null,"(ni ZO)",-7.2000000000000028]
["LB32",null,"mala - manjše od 1MW","LB32",0,59.28,59.28,"OP=SDRS","(ni ZO)",59.28,null,"(ni ZO)",-7.2000000000000028]
["LB33",null,"srednja - od 1MW do vključno 10MW ","LB33",0,59.28,59.28,"OP=SDRS","(ni ZO)",59.28,null,"(ni ZO)",-7.2000000000000028]
["LB34",null,"velika - nad 10MW do vključno 125MW","LB34",0,59.28,59.28,"OP=SDRS","(ni ZO)",59.28,null,"(ni ZO)",-7.2000000000000028]
["BP11","6.1 Bioplinske enote - biomasa","mikro - manjše od 50kW","BP11",118.72,41.02,159.74,0.88,159.74,127.28,null,-9.9699999999999989,-7.539999999999992]
["BP12",null,"mala - manjše od 1MW","BP12",111.75,43.66,155.41,0.91,155.41,121.84,null,-10.870000000000005,-8.3599999999999852]
["BP13",null,"srednja - od 1MW do vključno 10MW ","BP13",96.18,44.19,140.37,0.92,140.37,106.43,null,-12.689999999999998,-10.149999999999991]
["BP14",null,"velika - nad 10MW do vključno 125MW","BP14","(ni predv.)","(ni predv.)","(ni predv.)",1,"(ni predv.)","(ni predv.)",null,"(ni predv.)","(ni predv.)"]
["BP21","6.2 Bioplinske enote - odpadki","mikro - manjše od 50kW","BP21",139.22999999999999,0,139.22999999999999,0.88,139.22999999999999,106.77,null,0,2.4299999999999926]
["BP22",null,"mala - manjše od 1MW","BP22",139.22999999999999,0,139.22999999999999,0.91,139.22999999999999,105.66,null,0,2.5099999999999909]
["BP23",null,"srednja - od 1MW do vključno 10MW ","BP23",129.15,0,129.15,0.92,129.15,95.21,null,0,2.539999999999992]
["BP24",null,"velika - nad 10MW do vključno 125MW","BP24","(ni predv.)","(ni predv.)","(ni predv.)",1,"(ni predv.)","(ni predv.)",null,"(ni predv.)","(ni predv.)"]
["ČN01","7. Elektrarne na bioplin iz čistilnih naprav","mikro - manjše od 50kW","ČN01",85.84,0,85.84,0.92,85.84,51.9,null,0,2.5399999999999991]
["ČN02",null,"mala - manjše od 1MW","ČN02",74.42,0,74.42,0.92,74.42,40.479999999999997,null,0,2.5399999999999991]
["ČN03",null,"srednja - od 1MW do vključno 10MW ","ČN03",66.09,0,66.09,0.92,66.09,32.15,null,0,2.5399999999999991]
["ČN04",null,"velika - nad 10MW do vključno 125MW","ČN04","(ni predv.)","(ni predv.)","(ni predv.)",1,"(ni predv.)","(ni predv.)",null,"(ni predv.)","(ni predv.)"]
["OP01","8. Elektrarne na odlagališčni plin","mikro - manjše od 50kW","OP01",99.33,0,99.33,0.92,99.33,65.39,null,0,2.5399999999999991]
["OP02",null,"mala - manjše od 1MW","OP02",67.47,0,67.47,0.92,67.47,33.53,null,0,2.5400000000000027]
["OP03",null,"srednja - od 1MW do vključno 10MW ","OP03",61.67,0,61.67,0.92,61.67,27.73,null,0,2.5399999999999991]
["OP04",null,"velika - nad 10MW do vključno 125MW","OP04","(ni predv.)","(ni predv.)","(ni predv.)",1,"(ni predv.)","(ni predv.)",null,"(ni predv.)","(ni predv.)"]
["BO01","9. Elektrarne na biološko razgradljive odpadke","mikro - manjše od 50kW","BO01","(ni predv.)","(ni predv.)","(ni predv.)",0.92,"(ni predv.)","(ni predv.)",null,"(ni predv.)","(ni predv.)"]
["BO02",null,"mala - manjše od 1MW","BO02",77.44,0,77.44,0.92,77.44,43.5,null,0,2.5399999999999991]
["BO03",null,"srednja - od 1MW do vključno 10MW ","BO03",74.34,0,74.34,0.92,74.34,40.4,null,0,2.5399999999999991]
["BO04",null,"velika - nad 10MW do vključno 125MW","BO04","(indvid.)",0,"(indvid.)",0.92,"(ni ZO)","(indvid.)",null,"(ni ZO; individ.)","(individ.)"]
["SL11","10. SPTE na lesno biomaso (do 4.000 ur)","mikro - manjše od 50kW","SL11","(indvid.)","(indvid.)","(indvid.)",0.85,"(indvid.)","(indvid.)",null,"(individ.)","(individ.)"]
["SL12",null,"mala - manjše od 1MW","SL12",293.27,43.86,337.13,0.88,337.13,304.67,null,-3.5499999999999545,-1.1200000000000045]
["SL13",null,"srednja - nižja - od 1MW do vključno 5MW","SL13",221.27,41.27,262.54000000000002,0.93,"(ni ZO)",228.23,null,"(ni ZO)",-0.78000000000000114]
["SL14",null,"srednja - višja - nad 5MW do vključno 25MW","SL14",159.27000000000001,36.380000000000003,195.65,0.93,"(ni ZO)",161.34,null,"(ni ZO)",-0.37999999999999545]
["SL15",null,"velika - nižja - nad 25MW do vključno 50MW","SL15",127.05,37.590000000000003,164.64,0.96,"(ni ZO)",129.22999999999999,null,"(ni ZO)",-0.39000000000001478]
["SL16",null,"velika - višja - nad 50MW do 200MW","SL16","(indvid.)","(indvid.)","(indvid.)",0.96,"(ni ZO)","(indvid.)",null,"(ni ZO; individ.)","(individ.)"]
["SL21","10. SPTE na lesno biomaso (več kot 4.000 ur)","mikro - manjše od 50kW","SL21","(indvid.)","(indvid.)","(indvid.)",0.9,"(indvid.)","(indvid.)",null,"(individ.)","(individ.)"]
["SL22",null,"mala - manjše od 1MW","SL22",186.62,43.86,230.48000000000002,0.92,230.48000000000002,196.54,null,-3.5499999999999829,-1.0100000000000193]
["SL23",null,"srednja - nižja - od 1MW do vključno 5MW","SL23",140.81,41.27,182.08,0.94,"(ni ZO)",147.4,null,"(ni ZO)",-0.75]
["SL24",null,"srednja - višja - nad 5MW do vključno 25MW","SL24",101.36,36.380000000000003,137.74,0.94,"(ni ZO)",103.06,null,"(ni ZO)",-0.34999999999999432]
["SL25",null,"velika - nižja - nad 25MW do vključno 50MW","SL25",80.849999999999994,37.590000000000003,118.44,0.97,"(ni ZO)",82.66,null,"(ni ZO)",-0.35999999999999943]
["SL26",null,"velika - višja - nad 50MW do 200MW","SL26","(indvid.)","(indvid.)","(indvid.)",0.97,"(ni ZO)","(indvid.)",null,"(ni ZO; individ.)","(individ.)"]
["SF11","11. SPTE na fosilna goriva (do 4.000 ur)","mikro - manjše od 50kW","SF11",174.07,56.09,230.16,0.85,230.16,198.8,null,-8.4299999999999784,-6.089999999999975]
["SF12",null,"mala - manjše od 1MW","SF12",92.94,55.61,148.55000000000001,0.88,148.55000000000001,116.09,null,-8.9799999999999898,-6.5499999999999972]
["SF13",null,"srednja - nižja - od 1MW do vključno 5MW","SF13",73.099999999999994,40.729999999999997,113.82999999999998,0.93,"(ni ZO)",79.52,null,"(ni ZO)",-6.8500000000000085]
["SF14",null,"srednja - višja - nad 5MW do vključno 25MW","SF14",64,45.33,109.33,0.93,"(ni ZO)",75.02,null,"(ni ZO)",-8.210000000000008]
["SF15",null,"velika - nižja - nad 25MW do vključno 50MW","SF15",72.5,40.729999999999997,113.22999999999999,0.96,"(ni ZO)",77.819999999999993,null,"(ni ZO)",-7.2600000000000051]
["SF16",null,"velika - višja - nad 50MW do 200MW","SF16",66.2,37.07,103.27000000000001,0.96,"(ni ZO)",67.86,null,"(ni ZO)",-6.5499999999999972]
["SF21","11. SPTE na fosilna goriva (več kot 4.000 ur)","mikro - manjše od 50kW","SF21",116.23,56.09,172.32,0.9,172.32,139.12,null,-8.4300000000000068,-5.9499999999999886]
["SF22",null,"mala - manjše od 1MW","SF22",62.41,55.61,118.02,0.92,118.02,84.08,null,-8.980000000000004,-6.4399999999999977]
["SF23",null,"srednja - nižja - od 1MW do vključno 5MW","SF23",49.43,40.729999999999997,90.16,0.94,"(ni ZO)",55.48,null,"(ni ZO)",-6.82]
["SF24",null,"srednja - višja - nad 5MW do vključno 25MW","SF24",43.27,45.33,88.6,0.94,"(ni ZO)",53.92,null,"(ni ZO)",-8.18]
["SF25",null,"velika - nižja - nad 25MW do vključno 50MW","SF25",47.59,40.729999999999997,88.32,0.97,"(ni ZO)",52.54,null,"(ni ZO)",-7.230000000000004]
["SF26",null,"velika - višja - nad 50MW do 200MW","SF26",43.22,37.07,80.289999999999992,0.97,"(ni ZO)",44.51,null,"(ni ZO)",-6.5200000000000031]
[]
[]
[]
[]
[]
[null,null,null,2016,2015,2014,2013,2012,2011,2010,2009,"Indeks cene 2016 (baza 2009)"]
[null,"EE","€/MWh",36.89,39.65,43.31,50.66,55.79,53.13,53.41,65]
[null,"LB sosežig","EUR/GJ",7.48,8.08,8.23,8.27,7.7,6.56,5.83,5.7]
[null,"lesna biomasa - Clb","€/t",52.87,57.15,58.22,58.5,54.47,46.4,41.2,40.299999999999997,1.3119099999999999]
[null,"koruzna silaža - Cs","EUR/t",23.34,31.33,28,32,24,24,24,23.59,0.98939999999999995]
[null,"zemeljski plin - Cb","€/Sm3",0.21310000000000001,0.27700000000000002,"0,3042 / 0,3570",0.40870000000000001,0.37680000000000002,"0,2868 / 0,3344","0,2271 / 0,2679",0.24,0.88792000000000004]

{"sheet":"Podpore 2013","index":6,"n_rows":279,"n_cols":12,"rows_kept":279,"cut":false,"hidden":true,"merged":[[0,0,0,8],[3,0,6,0],[7,0,10,0],[11,0,14,0],[15,0,18,0],[87,0,90,0],[91,0,94,0],[47,0,50,0],[51,0,54,0],[55,0,58,0],[59,0,62,0],[63,0,66,0],[67,0,70,0],[1,10,1,11],[71,0,74,0],[75,0,78,0],[79,0,82,0],[83,0,86,0],[23,0,26,0],[27,0,30,0],[31,0,34,0],[35,0,38,0],[39,0,42,0],[43,0,46,0],[19,0,22,0],[95,0,98,0],[99,0,104,0],[105,0,110,0],[111,0,116,0],[117,0,122,0]]}
["VIŠINE PODPOR 2013"]
[null,null,null,null,null,null,null,null,null,null,"Razlike v podporah 2013 - 2012"]
["VRSTA","RAZRED MOČI","KODA","NDRS 2013","SDRS 2013","Skupni 2013","Faktor B po Prilogi III","Cena ZO 2013","Višina OP 2013",null,"ZO2013 - ZO2012","OP2013 - OP2012"]
["1. Hidroelektrarne","mikro - manjše od 50kW","HE01",105.47,0,105.47,0.86,105.47,61.9,null,0,4.4099999999999966]
[null,"mala - manjše od 1MW","HE02",92.61,0,92.61,0.86,92.61,49.04,null,0,4.4099999999999966]
[null,"srednja - od 1MW do vključno 10MW ","HE03",82.34,0,82.34,0.9,82.34,36.75,null,0,4.6199999999999974]
[null,"velika - nad 10MW do vključno 125MW","HE04",76.569999999999993,0,76.569999999999993,0.9,"(ni ZO)",30.98,null,"(ni ZO)",4.620000000000001]
["2. Vetrne elektrarne","mikro - manjše od 50kW","VE01",95.38,0,95.38,0.8,95.38,54.85,null,0,4.1000000000000014]
[null,"mala - manjše od 1MW","VE02",95.38,0,95.38,0.8,95.38,54.85,null,0,4.1000000000000014]
[null,"srednja - od 1MW do vključno 10MW ","VE03",95.38,0,95.38,0.8,95.38,54.85,null,0,4.1000000000000014]
[null,"velika - nad 10MW do vključno 125MW","VE04",86.74,0,86.74,0.86,"(ni ZO)",43.17,null,"(ni ZO)",4.4100000000000037]
["3.1 Sončne elektrarne - na stavbah 2009","mikro - manjše od 50kW","SE11",415.46,0,415.46,0.88,415.46,370.88,null,0,4.5199999999999818]
[null,"mala - manjše od 1MW","SE12",380.02,0,380.02,0.88,380.02,335.44,null,0,4.5199999999999818]
[null,"srednja - od 1MW do vključno 10MW ","SE13",315.36,0,315.36,0.91,315.36,269.26,null,0,4.6700000000000159]
[null,"velika - nad 10MW do vključno 125MW","SE14",280.70999999999998,0,280.70999999999998,1,"(ni ZO)",230.05,null,"(ni ZO)",5.1300000000000239]
["3.1. INT Sončne elektrarne - integrirane 2009","mikro - manjše od 50kW",null,477.78,0,477.78,0.88,477.78,433.2,null,0,4.5199999999999818]
[null,"mala - manjše od 1MW",null,437.02,0,437.02,0.88,437.02,392.44,null,0,4.5199999999999818]
[null,"srednja - od 1MW do vključno 10MW ",null,362.66,0,362.66,0.91,362.66,316.56,null,0,4.6700000000000159]
[null,"velika - nad 10MW do vključno 125MW",null,322.82,0,322.82,1,"(ni ZO)",272.16000000000003,null,"(ni ZO)",5.1300000000000523]
["3.2 Sončne elektrarne - samostojni objekti 2009","mikro - manjše od 50kW","SE21",390.42,0,390.42,0.88,390.42,345.84,null,0,4.5199999999999818]
[null,"mala - manjše od 1MW","SE22",359.71,0,359.71,0.88,359.71,315.13,null,0,4.5199999999999818]
[null,"srednja - od 1MW do vključno 10MW ","SE23",289.98,0,289.98,0.91,289.98,243.88,null,0,4.6699999999999875]
[null,"velika - nad 10MW do vključno 125MW","SE24",269.22000000000003,0,269.22000000000003,1,"(ni ZO)",218.56,null,"(ni ZO)",5.1299999999999955]
["3.1 Sončne elektrarne - na stavbah 2010","mikro - manjše od 50kW","SE11",386.38,0,386.38,0.88,386.38,341.8,null,0,4.5200000000000387]
[null,"mala - manjše od 1MW","SE12",353.42,0,353.42,0.88,353.42,308.83999999999997,null,0,4.5199999999999818]
[null,"srednja - od 1MW do vključno 10MW ","SE13",293.27999999999997,0,293.27999999999997,0.91,293.27999999999997,247.18,null,0,4.6700000000000159]
[null,"velika - nad 10MW do vključno 125MW","SE14",261.06,0,261.06,1,"(ni ZO)",210.4,null,"(ni ZO)",5.1299999999999955]
["3.1 INT Sončne elektrarne - integrirane 2010","mikro - manjše od 50kW",null,444.34,0,444.34,0.88,444.34,399.76,null,0,4.5199999999999818]
[null,"mala - manjše od 1MW",null,406.43,0,406.43,0.88,406.43,361.85,null,0,4.5200000000000387]
[null,"srednja - od 1MW do vključno 10MW ",null,337.27,0,337.27,0.91,337.27,291.17,null,0,4.6700000000000159]
[null,"velika - nad 10MW do vključno 125MW",null,300.22000000000003,0,300.22000000000003,1,"(ni ZO)",249.56,null,"(ni ZO)",5.1299999999999955]
["3.2 Sončne elektrarne - samostojni objekti 2010","mikro - manjše od 50kW","SE21",363.09,0,363.09,0.88,363.09,318.51,null,0,4.5199999999999818]
[null,"mala - manjše od 1MW","SE22",334.53,0,334.53,0.88,334.53,289.95,null,0,4.5199999999999818]
[null,"srednja - od 1MW do vključno 10MW ","SE23",269.68,0,269.68,0.91,269.68,223.58,null,0,4.6700000000000159]
[null,"velika - nad 10MW do vključno 125MW","SE24",250.37,0,250.37,1,"(ni ZO)",199.71,null,"(ni ZO)",5.1299999999999955]
["3.1 Sončne elektrarne - na stavbah 2011","mikro - manjše od 50kW","SE11",332.37,0,332.37,0.88,332.37,287.79000000000002,null,0,4.5200000000000387]
[null,"mala - manjše od 1MW","SE12",304.02,0,304.02,0.88,304.02,259.44,null,0,4.5200000000000102]
[null,"srednja - od 1MW do vključno 10MW ","SE13",252.29,0,252.29,0.91,252.29,206.19,null,0,4.6699999999999875]
[null,"velika - nad 10MW do vključno 125MW","SE14",224.57,0,224.57,1,"(ni ZO)",173.91,null,"(ni ZO)",5.1299999999999955]
["3.1 INT Sončne elektrarne - integrirane 2011","mikro - manjše od 50kW",null,382.23,0,382.23,0.88,382.23,337.65,null,0,4.5199999999999818]
[null,"mala - manjše od 1MW",null,349.62,0,349.62,0.88,349.62,305.04000000000002,null,0,4.5200000000000387]
[null,"srednja - od 1MW do vključno 10MW ",null,290.13,0,290.13,0.91,290.13,244.03,null,0,4.6699999999999875]
[null,"velika - nad 10MW do vključno 125MW",null,258.26,0,258.26,1,"(ni ZO)",207.6,null,"(ni ZO)",5.1299999999999955]
["3.2 Sončne elektrarne - samostojni objekti 2011","mikro - manjše od 50kW","SE21",312.33999999999997,0,312.33999999999997,0.88,312.33999999999997,267.76,null,0,4.5199999999999818]
[null,"mala - manjše od 1MW","SE22",287.77,0,287.77,0.88,287.77,243.19,null,0,4.5200000000000102]
[null,"srednja - od 1MW do vključno 10MW ","SE23",231.98,0,231.98,0.91,231.98,185.88,null,0,4.6699999999999875]
[null,"velika - nad 10MW do vključno 125MW","SE24",215.38,0,215.38,1,"(ni ZO)",164.72,null,"(ni ZO)",5.1299999999999955]
["3.1 Sončne elektrarne - na stavbah 2012 H1","mikro - manjše od 50kW","SE11",290.82,0,290.82,0.88,290.82,246.24,null,0,4.5200000000000102]
[null,"mala - manjše od 1MW","SE12",266.01,0,266.01,0.88,266.01,221.43,null,0,4.5200000000000102]
[null,"srednja - od 1MW do vključno 10MW ","SE13",220.75,0,220.75,0.91,220.75,174.65,null,0,4.6700000000000159]
[null,"velika - nad 10MW do vključno 125MW","SE14",196.5,0,196.5,1,"(ni ZO)",145.84,null,"(ni ZO)",5.1299999999999955]
["3.1 Sončne elektrarne - na stavbah 2012 H2","mikro - manjše od 50kW","SE11",197.55,0,197.55,0.88,197.55,152.97,null,0,4.5200000000000102]
[null,"mala - manjše od 1MW","SE12",180.7,0,180.7,0.88,180.7,136.12,null,0,4.5200000000000102]
[null,"srednja - od 1MW do vključno 10MW ","SE13",149.94999999999999,0,149.94999999999999,0.91,149.94999999999999,103.85,null,0,4.6699999999999875]
[null,"velika - nad 10MW do vključno 125MW","SE14",133.47999999999999,0,133.47999999999999,1,"(ni ZO)",82.82,null,"(ni ZO)",5.1299999999999955]
["3.2 Sončne elektrarne - ostale 2012 H1","mikro - manjše od 50kW","SE21",273.29000000000002,0,273.29000000000002,0.88,273.29000000000002,228.71,null,0,4.5200000000000102]
[null,"mala - manjše od 1MW","SE22",251.8,0,251.8,0.88,251.8,207.22,null,0,4.5200000000000102]
[null,"srednja - od 1MW do vključno 10MW ","SE23",202.99,0,202.99,0.91,202.99,156.88999999999999,null,0,4.6699999999999875]
[null,"velika - nad 10MW do vključno 125MW","SE24",188.45,0,188.45,1,"(ni ZO)",137.79,null,"(ni ZO)",5.1299999999999955]
["3.2 Sončne elektrarne - ostale 2012 H2","mikro - manjše od 50kW","SE21",185.64,0,185.64,0.88,185.64,141.06,null,0,4.5200000000000102]
[null,"mala - manjše od 1MW","SE22",171.04,0,171.04,0.88,171.04,126.46,null,0,4.519999999999996]
[null,"srednja - od 1MW do vključno 10MW ","SE23",137.88999999999999,0,137.88999999999999,0.91,137.88999999999999,91.79,null,0,4.6700000000000017]
[null,"velika - nad 10MW do vključno 125MW","SE24",128.01,0,128.01,1,"(ni ZO)",77.349999999999994,null,"(ni ZO)",5.1299999999999955]
["4. Geotermalne elektrarne","mikro - manjše od 50kW","GT01",152.47,0,152.47,0.92,152.47,105.86,null,0,4.7199999999999989]
[null,"mala - manjše od 1MW","GT02",152.47,0,152.47,0.92,152.47,105.86,null,0,4.7199999999999989]
[null,"srednja - od 1MW do vključno 10MW ","GT03",152.47,0,152.47,0.92,152.47,105.86,null,0,4.7199999999999989]
[null,"velika - nad 10MW do vključno 125MW","GT04","(indvid.)",0,"(indvid.)",0.92,"(ni ZO)","(indvid.)",null,"(ni ZO; individ.)","(individ.)"]
["5.1 Elektrarne na lesno biomaso","mikro - manjše od 50kW","LB11","(indvid.)","(indvid.)","(indvid.)",0.88,"(indvid.)","(indvid.)",null,"(individ.)","(individ.)"]
[null,"mala - manjše od 1MW","LB12",161.94999999999999,90.58,252.52999999999997,0.91,252.52999999999997,206.43,null,6.2399999999999807,10.909999999999997]
[null,"srednja - od 1MW do vključno 10MW ","LB13",115.52,75.37,190.89,0.92,190.89,144.28,null,5.1899999999999977,9.9099999999999966]
[null,"velika - nad 10MW do vključno 125MW","LB14","(indvid.)","(indvid.)","(indvid.)",0.92,"(ni ZO)","(indvid.)",null,"(ni ZO; individ.)","(individ.)"]
["5.2.Sosežig lesne biomase >5%","mikro - manjše od 50kW","LB21",51.34,74.319999999999993,125.66,0.88,"(ni ZO)",81.08,null,"(ni ZO)",9.64]
[null,"mala - manjše od 1MW","LB22",51.34,74.319999999999993,125.66,0.91,"(ni ZO)",79.56,null,"(ni ZO)",9.7900000000000063]
[null,"srednja - od 1MW do vključno 10MW ","LB23",51.34,74.319999999999993,125.66,0.92,"(ni ZO)",79.05,null,"(ni ZO)",9.8400000000000034]
[null,"velika - nad 10MW do vključno 125MW","LB24",null,null,"(indvid.)",0.92,"(ni ZO)","(indvid.)",null,"(ni ZO; individ.)","(individ.)"]
["5.3.Sosežig lesne biomase <5%","mikro - manjše od 50kW","LB31",0,67.92,67.92,"OP=SDRS","(ni ZO)",67.92,null,"(ni ZO)",7.32]
[null,"mala - manjše od 1MW","LB32",0,67.92,67.92,"OP=SDRS","(ni ZO)",67.92,null,"(ni ZO)",7.32]
[null,"srednja - od 1MW do vključno 10MW ","LB33",0,67.92,67.92,"OP=SDRS","(ni ZO)",67.92,null,"(ni ZO)",7.32]
[null,"velika - nad 10MW do vključno 125MW","LB34",0,67.92,67.92,"OP=SDRS","(ni ZO)",67.92,null,"(ni ZO)",7.32]
["6.1 Bioplinske enote - biomasa","mikro - manjše od 50kW","BP11",118.72,51.82,170.54,0.88,170.54,125.96,null,9.9799999999999898,14.5]
[null,"mala - manjše od 1MW","BP12",111.75,55.44,167.19,0.91,167.19,121.09,null,10.879999999999995,15.549999999999997]
[null,"srednja - od 1MW do vključno 10MW ","BP13",96.18,57.94,154.12,0.92,154.12,107.51,null,12.699999999999989,17.420000000000002]
[null,"velika - nad 10MW do vključno 125MW","BP14","(ni predv.)","(ni predv.)","(ni predv.)",1,"(ni predv.)","(ni predv.)",null,"(ni predv.)","(ni predv.)"]
["6.2 Bioplinske enote - odpadki","mikro - manjše od 50kW","BP21",139.22999999999999,0,139.22999999999999,0.88,139.22999999999999,94.65,null,0,4.5200000000000102]
[null,"mala - manjše od 1MW","BP22",139.22999999999999,0,139.22999999999999,0.91,139.22999999999999,93.13,null,0,4.6700000000000017]
[null,"srednja - od 1MW do vključno 10MW ","BP23",129.15,0,129.15,0.92,129.15,82.54,null,0,4.7200000000000131]
[null,"velika - nad 10MW do vključno 125MW","BP24","(ni predv.)","(ni predv.)","(ni predv.)",1,"(ni predv.)","(ni predv.)",null,"(ni predv.)","(ni predv.)"]
["7. Elektrarne na bioplin iz čistilnih naprav","mikro - manjše od 50kW","ČN01",85.84,0,85.84,0.92,85.84,39.229999999999997,null,0,4.7199999999999989]
[null,"mala - manjše od 1MW","ČN02",74.42,0,74.42,0.92,74.42,27.81,null,0,4.7199999999999989]
[null,"srednja - od 1MW do vključno 10MW ","ČN03",66.09,0,66.09,0.92,66.09,19.48,null,0,4.7200000000000006]
[null,"velika - nad 10MW do vključno 125MW","ČN04","(ni predv.)","(ni predv.)","(ni predv.)",1,"(ni predv.)","(ni predv.)",null,"(ni predv.)","(ni predv.)"]
["8. Elektrarne na odlagališčni plin","mikro - manjše od 50kW","OP01",99.33,0,99.33,0.92,99.33,52.72,null,0,4.7199999999999989]
[null,"mala - manjše od 1MW","OP02",67.47,0,67.47,0.92,67.47,20.86,null,0,4.7199999999999989]
[null,"srednja - od 1MW do vključno 10MW ","OP03",61.67,0,61.67,0.92,61.67,15.06,null,0,4.7200000000000006]
[null,"velika - nad 10MW do vključno 125MW","OP04","(ni predv.)","(ni predv.)","(ni predv.)",1,"(ni predv.)","(ni predv.)",null,"(ni predv.)","(ni predv.)"]
["9. Elektrarne na biološko razgradljive odpadke","mikro - manjše od 50kW","BO01","(ni predv.)","(ni predv.)","(ni predv.)",0.92,"(ni predv.)","(ni predv.)",null,"(ni predv.)","(ni predv.)"]
[null,"mala - manjše od 1MW","BO02",77.44,0,77.44,0.92,77.44,30.83,null,0,4.7199999999999989]
[null,"srednja - od 1MW do vključno 10MW ","BO03",74.34,0,74.34,0.92,74.34,27.73,null,0,4.7199999999999989]
[null,"velika - nad 10MW do vključno 125MW","BO04","(indvid.)",0,"(indvid.)",0.92,"(ni ZO)","(indvid.)",null,"(ni ZO; individ.)","(individ.)"]
["10. SPTE na lesno biomaso (do 4.000 ur)","mikro - manjše od 50kW","SL11","(indvid.)","(indvid.)","(indvid.)",0.85,"(indvid.)","(indvid.)",null,"(individ.)","(individ.)"]
[null,"mala - manjše od 1MW","SL12",293.27,48.53,341.79999999999995,0.88,341.79999999999995,297.22000000000003,null,3.3499999999999659,7.8700000000000045]
[null,"srednja - nižja - od 1MW do vključno 5MW","SL13",221.27,45.67,266.94,0.93,"(ni ZO)",219.83,null,"(ni ZO)",7.9200000000000159]
[null,"srednja - višja - nad 5MW do vključno 25MW","SL14",159.27000000000001,40.25,199.52,0.93,"(ni ZO)",152.41,null,"(ni ZO)",7.539999999999992]
[null,"velika - nižja - nad 25MW do vključno 50MW","SL15",127.05,41.59,168.64,0.96,"(ni ZO)",120.01,null,"(ni ZO)",7.8000000000000114]
[null,"velika - višja - nad 50MW do 200MW","SL16","(indvid.)","(indvid.)","(indvid.)",0.96,"(ni ZO)","(indvid.)",null,"(ni ZO; individ.)","(individ.)"]
["10. SPTE na lesno biomaso (več kot 4.000 ur)","mikro - manjše od 50kW","SL21","(indvid.)","(indvid.)","(indvid.)",0.9,"(indvid.)","(indvid.)",null,"(individ.)","(individ.)"]
[null,"mala - manjše od 1MW","SL22",186.62,48.53,235.15,0.92,235.15,188.54,null,3.3499999999999943,8.0699999999999932]
[null,"srednja - nižja - od 1MW do vključno 5MW","SL23",140.81,45.67,186.48000000000002,0.94,"(ni ZO)",138.86000000000001,null,"(ni ZO)",7.9700000000000273]
[null,"srednja - višja - nad 5MW do vključno 25MW","SL24",101.36,40.25,141.61000000000001,0.94,"(ni ZO)",93.99,null,"(ni ZO)",7.5899999999999892]
[null,"velika - nižja - nad 25MW do vključno 50MW","SL25",80.849999999999994,41.59,122.44,0.97,"(ni ZO)",73.3,null,"(ni ZO)",7.8499999999999943]
[null,"velika - višja - nad 50MW do 200MW","SL26","(indvid.)","(indvid.)","(indvid.)",0.97,"(ni ZO)","(indvid.)",null,"(ni ZO; individ.)","(individ.)"]
["11. SPTE na fosilna goriva (do 4.000 ur)","mikro - manjše od 50kW","SF11",174.07,81.87,255.94,0.85,255.94,212.88,null,4.1999999999999886,8.5600000000000023]
[null,"mala - manjše od 1MW","SF12",92.94,83.09,176.03,0.88,176.03,131.44999999999999,null,4.4900000000000091,9.0099999999999909]
[null,"srednja - nižja - od 1MW do vključno 5MW","SF13",73.099999999999994,69.55,142.64999999999998,0.93,"(ni ZO)",95.54,null,"(ni ZO)",9.4700000000000131]
[null,"srednja - višja - nad 5MW do vključno 25MW","SF14",64,78.3,142.30000000000001,0.93,"(ni ZO)",95.19,null,"(ni ZO)",10.149999999999991]
[null,"velika - nižja - nad 25MW do vključno 50MW","SF15",72.5,71.06,143.56,0.96,"(ni ZO)",94.93,null,"(ni ZO)",9.8700000000000045]
[null,"velika - višja - nad 50MW do 200MW","SF16",66.2,65.22,131.42000000000002,0.96,"(ni ZO)",82.79,null,"(ni ZO)",9.5200000000000102]
["11. SPTE na fosilna goriva (več kot 4.000 ur)","mikro - manjše od 50kW","SF21",116.23,81.87,198.10000000000002,0.9,198.10000000000002,152.51,null,4.2000000000000171,8.8199999999999932]
[null,"mala - manjše od 1MW","SF22",62.41,83.09,145.5,0.92,145.5,98.89,null,4.4900000000000091,9.2099999999999937]
[null,"srednja - nižja - od 1MW do vključno 5MW","SF23",49.43,69.55,118.97999999999999,0.94,"(ni ZO)",71.36,null,"(ni ZO)",9.519999999999996]
[null,"srednja - višja - nad 5MW do vključno 25MW","SF24",43.27,78.3,121.57,0.94,"(ni ZO)",73.95,null,"(ni ZO)",10.200000000000003]
[null,"velika - nižja - nad 25MW do vključno 50MW","SF25",47.59,71.06,118.65,0.97,"(ni ZO)",69.510000000000005,null,"(ni ZO)",9.9200000000000017]
[null,"velika - višja - nad 50MW do 200MW","SF26",43.22,65.22,108.44,0.97,"(ni ZO)",59.3,null,"(ni ZO)",9.57]
[]
[]
[null,null,2013,2012,2011,2010,2009,"Indeks cene 2013","Indeks cene 2012","Indeks cene 2011","Indeks cene 2010"]
["EE","€/MWh",50.66,55.79,53.13,53.41,65]
["PREMOG","EUR/GJ",2.61,2.65,2.83,2.87,3.5]
["LB sosežig","EUR/GJ",8.27,7.7,6.56,5.83,5.7]
["lesna biomasa - Clb","€/t",58.5,54.47,46.4,41.2,40.299999999999997,1.4516100000000001,1.35161,1.1513599999999999,1.02233]
["koruzna silaža - Cs","EUR/t",32,24,24,24,23.59,{"$f":"ROUND(C131/G131,5)","v":1.3565100000000001},1.01738,1.01738,1.01738]
["zemeljski plin - Cb","€/Sm3",0.40870000000000001,0.37680000000000002,0.33439999999999998,0.26790000000000003,0.24,1.70292,1.57,1.39333,1.11625]
[]
[]
[]
["PODPORE PV INSTALACIJA DEC 2012 in KASNEJE"]
[]
["MESEC: DECEMBER 2012"]
["Koda","Referenčni stroški (EUR/MWh)","Cena ZO (EUR/MWh)","Višina OP (EUR/MWh)"]
["SE11",150,150,105.42]
["SE12",137.19,137.19,92.61]
["SE13",113.85,113.85,67.75]
["SE14",101.34,"/",50.68]
["SE21",140.94999999999999,140.94999999999999,96.37]
["SE22",129.86000000000001,129.86000000000001,85.28]
["SE23",104.68,104.68,58.58]
["SE24",97.19,"/",46.53]
[]
["MESEC: JANUAR 2013"]
["Koda","Referenčni stroški (EUR/MWh)","Cena ZO (EUR/MWh)","Višina OP (EUR/MWh)"]
["SE11",147,147,102.42]
["SE12",134.44999999999999,134.44999999999999,89.87]
["SE13",111.57,111.57,65.47]
["SE14",99.31,"/",48.65]
["SE21",138.13,138.13,93.55]
["SE22",127.26,127.26,82.68]
["SE23",102.59,102.59,56.49]
["SE24",95.25,"/",44.59]
[]
["MESEC: FEBRUAR 2013"]
["Koda","Referenčni stroški (EUR/MWh)","Cena ZO (EUR/MWh)","Višina OP (EUR/MWh)"]
["SE11",144.06,144.06,99.48]
["SE12",131.76,131.76,87.18]
["SE13",109.34,109.34,63.24]
["SE14",97.32,"/",46.66]
["SE21",135.37,135.37,90.79]
["SE22",124.71,124.71,80.13]
["SE23",100.54,100.54,54.44]
["SE24",93.35,"/",42.69]
[]
["MESEC: MAREC 2013"]
["Koda","Referenčni stroški (EUR/MWh)","Cena ZO (EUR/MWh)","Višina OP (EUR/MWh)"]
["SE11",141.18,141.18,96.6]
["SE12",129.12,129.12,84.54]
["SE13",107.15,107.15,61.05]
["SE14",95.37,"/",44.71]
["SE21",132.66,132.66,88.08]
["SE22",122.22,122.22,77.64]
["SE23",98.53,98.53,52.43]
["SE24",91.48,"/",40.82]
[]
["MESEC: APRIL 2013"]
["Koda","Referenčni stroški (EUR/MWh)","Cena ZO (EUR/MWh)","Višina OP (EUR/MWh)"]
["SE11",138.36000000000001,138.36000000000001,93.78]
["SE12",126.54,126.54,81.96]
["SE13",105.01,105.01,58.91]
["SE14",93.46,"/",42.8]
["SE21",130.01,130.01,85.43]
["SE22",119.78,119.78,75.2]
["SE23",96.56,96.56,50.46]
["SE24",89.65,"/",38.99]
[]
["MESEC: MAJ 2013"]
["Koda","Referenčni stroški (EUR/MWh)","Cena ZO (EUR/MWh)","Višina OP (EUR/MWh)"]
["SE11",135.59,135.59,91.01]
["SE12",124.01,124.01,79.430000000000007]
["SE13",102.91,102.91,56.81]
["SE14",91.59,"/",40.93]
["SE21",127.41,127.41,82.83]
["SE22",117.38,117.38,72.8]
["SE23",94.63,94.63,48.53]
["SE24",87.86,"/",37.200000000000003]
[]
["MESEC: JUNIJ 2013"]
["Koda","Referenčni stroški (EUR/MWh)","Cena ZO (EUR/MWh)","Višina OP (EUR/MWh)"]
["SE11",132.88,132.88,88.3]
["SE12",121.53,121.53,76.95]
["SE13",100.85,100.85,54.75]
["SE14",89.76,"/",39.1]
["SE21",124.86,124.86,80.28]
["SE22",115.03,115.03,70.45]
["SE23",92.74,92.74,46.64]
["SE24",86.1,"/",35.44]
[]
["MESEC: JULIJ 2013"]
["Koda","Referenčni stroški (EUR/MWh)","Cena ZO (EUR/MWh)","Višina OP (EUR/MWh)"]
["SE11",130.22,130.22,85.64]
["SE12",119.1,119.1,74.52]
["SE13",98.83,98.83,52.73]
["SE14",87.96,"/",37.299999999999997]
["SE21",122.36,122.36,77.78]
["SE22",112.73,112.73,68.150000000000006]
["SE23",90.89,90.89,44.79]
["SE24",84.38,"/",33.72]
[]
["MESEC: AVGUST 2013"]
["Koda","Referenčni stroški (EUR/MWh)","Cena ZO (EUR/MWh)","Višina OP (EUR/MWh)"]
["SE11",127.62,127.62,83.04]
["SE12",116.72,116.72,72.14]
["SE13",96.85,96.85,50.75]
["SE14",86.2,"/",35.54]
["SE21",119.91,119.91,75.33]
["SE22",110.48,110.48,65.900000000000006]
["SE23",89.07,89.07,42.97]
["SE24",82.69,"/",32.03]
[]
["MESEC: SEPTEMBER 2013"]
["Koda","Referenčni stroški (EUR/MWh)","Cena ZO (EUR/MWh)","Višina OP (EUR/MWh)"]
["SE11",125.07,125.07,80.489999999999995]
["SE12",114.39,114.39,69.81]
["SE13",94.91,94.91,48.81]
["SE14",84.48,"/",33.82]
["SE21",117.51,117.51,72.930000000000007]
["SE22",108.27,108.27,63.69]
["SE23",87.29,87.29,41.19]
["SE24",81.040000000000006,"/",30.38]
[]
["MESEC: OKTOBER 2013"]
["Koda","Referenčni stroški (EUR/MWh)","Cena ZO (EUR/MWh)","Višina OP (EUR/MWh)"]
["SE11",122.57,122.57,77.989999999999995]
["SE12",112.1,112.1,67.52]
["SE13",93.01,93.01,46.91]
["SE14",82.79,"/",32.130000000000003]
["SE21",115.16,115.16,70.58]
["SE22",106.1,106.1,61.52]
["SE23",85.54,85.54,39.44]
["SE24",79.42,"/",28.76]
[]
["MESEC: NOVEMBER 2013"]
["Koda","Referenčni stroški (EUR/MWh)","Cena ZO (EUR/MWh)","Višina OP (EUR/MWh)"]
["SE11",120.12,120.12,75.540000000000006]
["SE12",109.86,109.86,65.28]
["SE13",91.15,91.15,45.05]
["SE14",81.13,"/",30.47]
["SE21",112.86,112.86,68.28]
["SE22",103.98,103.98,59.4]
["SE23",83.83,83.83,37.729999999999997]
["SE24",77.83,"/",27.17]
[]
["MESEC: DECEMBER 2013"]
["Koda","Referenčni stroški (EUR/MWh)","Cena ZO (EUR/MWh)","Višina OP (EUR/MWh)"]
["SE11",117.72,117.72,73.14]
["SE12",107.66,107.66,63.08]
["SE13",89.33,89.33,43.23]
["SE14",79.510000000000005,"/",28.85]
["SE21",110.6,110.6,66.02]
["SE22",101.9,101.9,57.32]
["SE23",82.15,82.15,36.049999999999997]
["SE24",76.27,"/",25.61]

{"sheet":"Podpore 2012","index":7,"n_rows":132,"n_cols":11,"rows_kept":132,"cut":false,"hidden":true,"merged":[[55,0,58,0],[59,0,62,0],[0,0,0,8],[105,0,110,0],[111,0,116,0],[51,0,54,0],[63,0,66,0],[67,0,70,0],[71,0,74,0],[75,0,78,0],[27,0,30,0],[31,0,34,0],[35,0,38,0],[39,0,42,0],[43,0,46,0],[47,0,50,0],[117,0,122,0],[79,0,82,0],[83,0,86,0],[87,0,90,0],[91,0,94,0],[95,0,98,0],[99,0,104,0],[23,0,26,0],[3,0,6,0],[7,0,10,0],[11,0,14,0],[15,0,18,0],[19,0,22,0]]}
["VIŠINE PODPOR 2012"]
[]
["VRSTA","RAZRED MOČI","KODA","NDRS 2012","SDRS 2012","Skupni refernčni stroški 2012","Faktor B po Prilogi III","Cena ZO 2012","Višina OP 2012"]
["1. Hidroelektrarne","mikro - manjše od 50kW","HE01",105.47,0,105.47,0.86,105.47,57.49]
[null,"mala - manjše od 1MW","HE02",92.61,0,92.61,0.86,92.61,44.63]
[null,"srednja - od 1MW do vključno 10MW ","HE03",82.34,0,82.34,0.9,82.34,32.130000000000003]
[null,"velika - nad 10MW do vključno 125MW","HE04",76.569999999999993,0,76.569999999999993,0.9,"(ni ZO)",26.36]
["2. Vetrne elektrarne","mikro - manjše od 50kW","VE01",95.38,0,95.38,0.8,95.38,50.75]
[null,"mala - manjše od 1MW","VE02",95.38,0,95.38,0.8,95.38,50.75]
[null,"srednja - od 1MW do vključno 10MW ","VE03",95.38,0,95.38,0.8,95.38,50.75]
[null,"velika - nad 10MW do vključno 125MW","VE04",86.74,0,86.74,0.86,"(ni ZO)",38.76]
["3.1 Sončne elektrarne - na stavbah 2009","mikro - manjše od 50kW","SE11",415.46,0,415.46,0.88,415.46,366.36]
[null,"mala - manjše od 1MW","SE12",380.02,0,380.02,0.88,380.02,330.92]
[null,"srednja - od 1MW do vključno 10MW ","SE13",315.36,0,315.36,0.91,315.36,264.58999999999997]
[null,"velika - nad 10MW do vključno 125MW","SE14",280.70999999999998,0,280.70999999999998,1,"(ni ZO)",224.92]
["3.1. INT Sončne elektrarne - integrirane 2009","mikro - manjše od 50kW",null,477.78,0,477.78,0.88,477.78,428.68]
[null,"mala - manjše od 1MW",null,437.02,0,437.02,0.88,437.02,387.92]
[null,"srednja - od 1MW do vključno 10MW ",null,362.66,0,362.66,0.91,362.66,311.89]
[null,"velika - nad 10MW do vključno 125MW",null,322.82,0,322.82,1,"(ni ZO)",267.02999999999997]
["3.2 Sončne elektrarne - samostojni objekti 2009","mikro - manjše od 50kW","SE21",390.42,0,390.42,0.88,390.42,341.32]
[null,"mala - manjše od 1MW","SE22",359.71,0,359.71,0.88,359.71,310.61]
[null,"srednja - od 1MW do vključno 10MW ","SE23",289.98,0,289.98,0.91,289.98,239.21]
[null,"velika - nad 10MW do vključno 125MW","SE24",269.22000000000003,0,269.22000000000003,1,"(ni ZO)",213.43]
["3.1 Sončne elektrarne - na stavbah 2010","mikro - manjše od 50kW","SE11",386.38,0,386.38,0.88,386.38,337.28]
[null,"mala - manjše od 1MW","SE12",353.42,0,353.42,0.88,353.42,304.32]
[null,"srednja - od 1MW do vključno 10MW ","SE13",293.27999999999997,0,293.27999999999997,0.91,293.27999999999997,242.51]
[null,"velika - nad 10MW do vključno 125MW","SE14",261.06,0,261.06,1,"(ni ZO)",205.27]
["3.1 INT Sončne elektrarne - integrirane 2010","mikro - manjše od 50kW",null,444.34,0,444.34,0.88,444.34,395.24]
[null,"mala - manjše od 1MW",null,406.43,0,406.43,0.88,406.43,357.33]
[null,"srednja - od 1MW do vključno 10MW ",null,337.27,0,337.27,0.91,337.27,286.5]
[null,"velika - nad 10MW do vključno 125MW",null,300.22000000000003,0,300.22000000000003,1,"(ni ZO)",244.43]
["3.2 Sončne elektrarne - samostojni objekti 2010","mikro - manjše od 50kW","SE21",363.09,0,363.09,0.88,363.09,313.99]
[null,"mala - manjše od 1MW","SE22",334.53,0,334.53,0.88,334.53,285.43]
[null,"srednja - od 1MW do vključno 10MW ","SE23",269.68,0,269.68,0.91,269.68,218.91]
[null,"velika - nad 10MW do vključno 125MW","SE24",250.37,0,250.37,1,"(ni ZO)",194.58]
["3.1 Sončne elektrarne - na stavbah 2011","mikro - manjše od 50kW","SE11",332.37,0,332.37,0.88,332.37,283.27]
[null,"mala - manjše od 1MW","SE12",304.02,0,304.02,0.88,304.02,254.92]
[null,"srednja - od 1MW do vključno 10MW ","SE13",252.29,0,252.29,0.91,252.29,201.52]
[null,"velika - nad 10MW do vključno 125MW","SE14",224.57,0,224.57,1,"(ni ZO)",168.78]
["3.1 INT Sončne elektrarne - integrirane 2011","mikro - manjše od 50kW",null,382.23,0,382.23,0.88,382.23,333.13]
[null,"mala - manjše od 1MW",null,349.62,0,349.62,0.88,349.62,300.52]
[null,"srednja - od 1MW do vključno 10MW ",null,290.13,0,290.13,0.91,290.13,239.36]
[null,"velika - nad 10MW do vključno 125MW",null,258.26,0,258.26,1,"(ni ZO)",202.47]
["3.2 Sončne elektrarne - samostojni objekti 2011","mikro - manjše od 50kW","SE21",312.33999999999997,0,312.33999999999997,0.88,312.33999999999997,263.24]
[null,"mala - manjše od 1MW","SE22",287.77,0,287.77,0.88,287.77,238.67]
[null,"srednja - od 1MW do vključno 10MW ","SE23",231.98,0,231.98,0.91,231.98,181.21]
[null,"velika - nad 10MW do vključno 125MW","SE24",215.38,0,215.38,1,"(ni ZO)",159.59]
["3.1 Sončne elektrarne - na stavbah 2012 H1","mikro - manjše od 50kW","SE11",290.82,0,290.82,0.88,290.82,241.72]
[null,"mala - manjše od 1MW","SE12",266.01,0,266.01,0.88,266.01,216.91]
[null,"srednja - od 1MW do vključno 10MW ","SE13",220.75,0,220.75,0.91,220.75,169.98]
[null,"velika - nad 10MW do vključno 125MW","SE14",196.5,0,196.5,1,"(ni ZO)",140.71]
["3.2 Sončne elektrarne - ostale 2012 H1","mikro - manjše od 50kW","SE21",273.29000000000002,0,273.29000000000002,0.88,273.29000000000002,224.19]
[null,"mala - manjše od 1MW","SE22",251.8,0,251.8,0.88,251.8,202.7]
[null,"srednja - od 1MW do vključno 10MW ","SE23",202.99,0,202.99,0.91,202.99,152.22]
[null,"velika - nad 10MW do vključno 125MW","SE24",188.45,0,188.45,1,"(ni ZO)",132.66]
["3.1 Sončne elektrarne - na stavbah 2012 H2","mikro - manjše od 50kW","SE11",249.28,0,249.28,0.88,197.55,148.44999999999999,null,"Popravek glede na UL 42/2012 z dne 8.6.2012"]
[null,"mala - manjše od 1MW","SE12",228.01,0,228.01,0.88,180.7,131.6]
[null,"srednja - od 1MW do vključno 10MW ","SE13",189.22,0,189.22,0.91,149.94999999999999,99.18]
[null,"velika - nad 10MW do vključno 125MW","SE14",168.43,0,168.43,1,"(ni ZO)",77.69]
["3.2 Sončne elektrarne - ostale 2012 H2","mikro - manjše od 50kW","SE21",234.25,0,234.25,0.88,185.64,136.54]
[null,"mala - manjše od 1MW","SE22",215.83,0,215.83,0.88,171.04,121.94]
[null,"srednja - od 1MW do vključno 10MW ","SE23",173.99,0,173.99,0.91,137.88999999999999,87.12]
[null,"velika - nad 10MW do vključno 125MW","SE24",161.53,0,161.53,1,"(ni ZO)",72.22]
["4. Geotermalne elektrarne","mikro - manjše od 50kW","GT01",152.47,0,152.47,0.92,152.47,101.14]
[null,"mala - manjše od 1MW","GT02",152.47,0,152.47,0.92,152.47,101.14]
[null,"srednja - od 1MW do vključno 10MW ","GT03",152.47,0,152.47,0.92,152.47,101.14]
[null,"velika - nad 10MW do vključno 125MW","GT04","(indvid.)",0,"(indvid.)",0.92,"(ni ZO)","(indvid.)"]
["5.1 Elektrarne na lesno biomaso","mikro - manjše od 50kW","LB11","(indvid.)","(indvid.)","(indvid.)",0.88,"(indvid.)","(indvid.)"]
[null,"mala - manjše od 1MW","LB12",161.94999999999999,84.34,246.29,0.91,246.29,195.52]
[null,"srednja - od 1MW do vključno 10MW ","LB13",115.52,70.180000000000007,185.7,0.92,185.7,134.37]
[null,"velika - nad 10MW do vključno 125MW","LB14","(indvid.)","(indvid.)","(indvid.)",0.92,"(ni ZO)","(indvid.)"]
["5.2.Sosežig lesne biomase >5%","mikro - manjše od 50kW","LB21",51.34,69.2,120.54,0.88,"(ni ZO)",71.44]
[null,"mala - manjše od 1MW","LB22",51.34,69.2,120.54,0.91,"(ni ZO)",69.77]
[null,"srednja - od 1MW do vključno 10MW ","LB23",51.34,69.2,120.54,0.92,"(ni ZO)",69.209999999999994]
[null,"velika - nad 10MW do vključno 125MW","LB24","(indvid.)","(indvid.)","(indvid.)",0.92,"(ni ZO)","(indvid.)"]
["5.3.Sosežig lesne biomase <5%","mikro - manjše od 50kW","LB31",0,60.6,60.6,"OP=SDRS","(ni ZO)",60.6]
[null,"mala - manjše od 1MW","LB32",0,60.6,60.6,"OP=SDRS","(ni ZO)",60.6]
[null,"srednja - od 1MW do vključno 10MW ","LB33",0,60.6,60.6,"OP=SDRS","(ni ZO)",60.6]
[null,"velika - nad 10MW do vključno 125MW","LB34",0,60.6,60.6,"OP=SDRS","(ni ZO)",60.6]
["6.1 Bioplinske enote - biomasa","mikro - manjše od 50kW","BP11",118.72,41.84,160.56,0.88,160.56,111.46]
[null,"mala - manjše od 1MW","BP12",111.75,44.56,156.31,0.91,156.31,105.54]
[null,"srednja - od 1MW do vključno 10MW ","BP13",96.18,45.24,141.42000000000002,0.92,141.42000000000002,90.09]
[null,"velika - nad 10MW do vključno 125MW","BP14","(ni predv.)","(ni predv.)","(ni predv.)",1,"(ni predv.)","(ni predv.)"]
["6.2 Bioplinske enote - odpadki","mikro - manjše od 50kW","BP21",139.22999999999999,0,139.22999999999999,0.88,139.22999999999999,90.13]
[null,"mala - manjše od 1MW","BP22",139.22999999999999,0,139.22999999999999,0.91,139.22999999999999,88.46]
[null,"srednja - od 1MW do vključno 10MW ","BP23",129.15,0,129.15,0.92,129.15,77.819999999999993]
[null,"velika - nad 10MW do vključno 125MW","BP24","(ni predv.)","(ni predv.)","(ni predv.)",1,"(ni predv.)","(ni predv.)"]
["7. Elektrarne na bioplin iz čistilnih naprav","mikro - manjše od 50kW","ČN01",85.84,0,85.84,0.92,85.84,34.51]
[null,"mala - manjše od 1MW","ČN02",74.42,0,74.42,0.92,74.42,23.09]
[null,"srednja - od 1MW do vključno 10MW ","ČN03",66.09,0,66.09,0.92,66.09,14.76]
[null,"velika - nad 10MW do vključno 125MW","ČN04","(ni predv.)","(ni predv.)","(ni predv.)",1,"(ni predv.)","(ni predv.)"]
["8. Elektrarne na odlagališčni plin","mikro - manjše od 50kW","OP01",99.33,0,99.33,0.92,99.33,48]
[null,"mala - manjše od 1MW","OP02",67.47,0,67.47,0.92,67.47,16.14]
[null,"srednja - od 1MW do vključno 10MW ","OP03",61.67,0,61.67,0.92,61.67,10.34]
[null,"velika - nad 10MW do vključno 125MW","OP04","(ni predv.)","(ni predv.)","(ni predv.)",1,"(ni predv.)","(ni predv.)"]
["9. Elektrarne na biološko razgradljive odpadke","mikro - manjše od 50kW","BO01","(ni predv.)","(ni predv.)","(ni predv.)",0.92,"(ni predv.)","(ni predv.)"]
[null,"mala - manjše od 1MW","BO02",77.44,0,77.44,0.92,77.44,26.11]
[null,"srednja - od 1MW do vključno 10MW ","BO03",74.34,0,74.34,0.92,74.34,23.01]
[null,"velika - nad 10MW do vključno 125MW","BO04","(indvid.)",0,"(indvid.)",0.92,"(ni ZO)","(indvid.)"]
["10. SPTE na lesno biomaso (do 4.000 ur)","mikro - manjše od 50kW","SL11","(indvid.)","(indvid.)","(indvid.)",0.85,"(indvid.)","(indvid.)"]
[null,"mala - manjše od 1MW","SL12",293.27,45.18,338.45,0.88,338.45,289.35000000000002]
[null,"srednja - nižja - od 1MW do vključno 5MW","SL13",221.27,42.52,263.79000000000002,0.93,"(ni ZO)",211.91]
[null,"srednja - višja - nad 5MW do vključno 25MW","SL14",159.27000000000001,37.479999999999997,196.75,0.93,"(ni ZO)",144.87]
[null,"velika - nižja - nad 25MW do vključno 50MW","SL15",127.05,38.72,165.76999999999998,0.96,"(ni ZO)",112.21]
[null,"velika - višja - nad 50MW do 200MW","SL16","(indvid.)","(indvid.)","(indvid.)",0.96,"(ni ZO)","(indvid.)"]
["10. SPTE na lesno biomaso (več kot 4.000 ur)","mikro - manjše od 50kW","SL21","(indvid.)","(indvid.)","(indvid.)",0.9,"(indvid.)","(indvid.)"]
[null,"mala - manjše od 1MW","SL22",186.62,45.18,231.8,0.92,231.8,180.47]
[null,"srednja - nižja - od 1MW do vključno 5MW","SL23",140.81,42.52,183.33,0.94,"(ni ZO)",130.88999999999999]
[null,"srednja - višja - nad 5MW do vključno 25MW","SL24",101.36,37.479999999999997,138.84,0.94,"(ni ZO)",86.4]
[null,"velika - nižja - nad 25MW do vključno 50MW","SL25",80.849999999999994,38.72,119.57,0.97,"(ni ZO)",65.45]
[null,"velika - višja - nad 50MW do 200MW","SL26","(indvid.)","(indvid.)","(indvid.)",0.97,"(ni ZO)","(indvid.)"]
["11. SPTE na fosilna goriva (do 4.000 ur)","mikro - manjše od 50kW","SF11",174.07,77.67,251.74,0.85,251.74,204.32]
[null,"mala - manjše od 1MW","SF12",92.94,78.599999999999994,171.54,0.88,171.54,122.44]
[null,"srednja - nižja - od 1MW do vključno 5MW","SF13",73.099999999999994,64.849999999999994,137.94999999999999,0.93,"(ni ZO)",86.07]
[null,"srednja - višja - nad 5MW do vključno 25MW","SF14",64,72.92,136.92000000000002,0.93,"(ni ZO)",85.04]
[null,"velika - nižja - nad 25MW do vključno 50MW","SF15",72.5,66.12,138.62,0.96,"(ni ZO)",85.06]
[null,"velika - višja - nad 50MW do 200MW","SF16",66.2,60.63,126.83000000000001,0.96,"(ni ZO)",73.27]
["11. SPTE na fosilna goriva (več kot 4.000 ur)","mikro - manjše od 50kW","SF21",116.23,77.67,193.9,0.9,193.9,143.69]
[null,"mala - manjše od 1MW","SF22",62.41,78.599999999999994,141.01,0.92,141.01,89.68]
[null,"srednja - nižja - od 1MW do vključno 5MW","SF23",49.43,64.849999999999994,114.28,0.94,"(ni ZO)",61.84]
[null,"srednja - višja - nad 5MW do vključno 25MW","SF24",43.27,72.92,116.19,0.94,"(ni ZO)",63.75]
[null,"velika - nižja - nad 25MW do vključno 50MW","SF25",47.59,66.12,113.71000000000001,0.97,"(ni ZO)",59.59]
[null,"velika - višja - nad 50MW do 200MW","SF26",43.22,60.63,103.85,0.97,"(ni ZO)",49.73]
[]
[]
[null,null,2012,2011,2010,2009,"Indeks cene 2012","Indeks cene 2011","Indeks cene 2010"]
["EE","€/MWh",55.79,53.13,53.41,65]
["PREMOG","EUR/GJ",2.65,2.83,2.87,3.5]
["LB sosežig","EUR/GJ",7.7,6.56,5.83,5.7]
["lesna biomasa - Clb","€/t",54.47,46.4,41.2,40.299999999999997,1.35161,1.1513599999999999,1.02233]
["koruzna silaža - Cs","EUR/t",24,24,24,23.59,1.01738,1.01738,1.01738]
["zemeljski plin - Cb","€/Sm3",0.37680000000000002,0.33439999999999998,0.26790000000000003,0.24,1.57,1.39333,1.11625]

{"sheet":"Metodologija - OU in spec I str","index":8,"n_rows":76,"n_cols":6,"rows_kept":76,"cut":false,"hidden":true,"merged":[]}
["METODOLOGIJA - predvidene obratovalne ure in specifični investicijski stroški"]
[]
[]
[null,"KODA","OU po metodologiji","Specifični investicijski stroški (EUR/kWel)","Možni dodatki"]
["1. Hidroelektrarne","HE01",4000,2300]
[null,"HE02",3500,1700]
[null,"HE03",3500,1500]
[null,"HE04",3500,1400]
["2. Vetrne elektrarne","VE01",2100,1200]
[null,"VE02",2100,1200]
[null,"VE03",2100,1200]
[null,"VE04",2100,1090]
["3.1 Sončne elektrarne - na stavbah","SE11",1050,3860,"INT","dodatek za INT le za priključitve do konca 2011; GD mora biti izdano do 30.9.2011"]
[null,"SE12",1050,3525,"INT","dodatek za INT le za priključitve do konca 2011; GD mora biti izdano do 30.9.2011"]
[null,"SE13",1050,2925,"INT","dodatek za INT le za priključitve do konca 2011; GD mora biti izdano do 30.9.2011"]
[null,"SE14",1050,2630,"INT","dodatek za INT le za priključitve do konca 2011; GD mora biti izdano do 30.9.2011"]
["3.2 Sončne elektrarne - samostojni objekti","SE21",1050,3620]
[null,"SE22",1050,3330]
[null,"SE23",1050,2685]
[null,"SE24",1050,2455]
["4. Geotermalne elektrarne","GT01",6000,4600,"T"]
[null,"GT02",6000,4600,"T"]
[null,"GT03",6000,4600,"T"]
[null,"GT04","(ind.)","(ind.)","T"]
["5.1 Elektrarne na lesno biomaso","LB11","(ind.)","(ind.)","LB"]
[null,"LB12",5500,4500,"LB"]
[null,"LB13",5500,3200,"LB"]
[null,"LB14","(ind.)","(ind.)","LB"]
["5.2.Sosežig lesne biomase >5%","LB21",5500,1400,"LB"]
[null,"LB22",5500,1400,"LB"]
[null,"LB23",5500,1400,"LB"]
[null,"LB24","(ind.)","(ind.)","LB"]
["6.1 Bioplinske enote - biomasa","BP11",6800,4000,"TS1S2","možen tudi odbitek glede substrata (UL 43/2011)"]
[null,"BP12",6800,3800,"TS1S2","možen tudi odbitek glede substrata (UL 43/2011)"]
[null,"BP13",6800,3300,"TS1","možen tudi odbitek glede substrata (UL 43/2011)"]
[null,"BP14","(ni predv,)","(ni predv,)"]
["6.2 Bioplinske enote - odpadki","BP21",6800,4800,"T"]
[null,"BP22",6800,4800,"T"]
[null,"BP23",6800,4500,"T"]
[null,"BP24","(ni predv,)","(ni predv,)"]
["7. Elektrarne na bioplin iz čistilnih naprav","ČN01",6000,2500,"T"]
[null,"ČN02",6000,2200,"T"]
[null,"ČN03",6000,2000,"T"]
[null,"ČN04","(ni predv,)","(ni predv,)"]
["8. Elektrarne na odlagališčni plin","OP01",6000,3400,"T"]
[null,"OP02",6000,2300,"T"]
[null,"OP03",6000,2100,"T"]
[null,"OP04","(ni predv,)","(ni predv,)"]
["9. Elektrarne na biološko razgradljive odpadke","BO01","(ni predv,)","(ni predv,)","T"]
[null,"BO02",6000,2500]
[null,"BO03",6000,2400,"T"]
[null,"BO04","(ind.)","(ind.)","T"]
["10. SPTE na lesno biomaso (do 4.000 ur)","SL11","(ind.)","(ind.)","LB"]
[null,"SL12",3500,4500,"LB"]
[null,"SL13",3500,3500,"LB"]
[null,"SL14",3500,2500,"LB"]
[null,"SL15",3500,2000,"LB"]
[null,"SL16","(ind.)","(ind.)","LB"]
["10. SPTE na lesno biomaso (več kot 4.000 ur)","SL21","(ind.)","(ind.)","LB"]
[null,"SL22",5500,4500,"LB"]
[null,"SL23",5500,3500,"LB"]
[null,"SL24",5500,2500,"LB"]
[null,"SL25",5500,2000,"LB"]
[null,"SL26","(ind.)","(ind.)","LB"]
["11. SPTE na fosilna goriva (do 4.000 ur)","SF11",3500,2900]
[null,"SF12",3500,1400]
[null,"SF13",3500,1100]
[null,"SF14",3500,1000]
[null,"SF15",3500,1200]
[null,"SF16",3500,1100]
["11. SPTE na fosilna goriva (več kot 4.000 ur)","SF21",5500,2900]
[null,"SF22",5500,1400]
[null,"SF23",5500,1100]
[null,"SF24",5500,1000]
[null,"SF25",5500,1200]
[null,"SF26",5500,1100]

{"sheet":"Šifranti","index":9,"n_rows":33,"n_cols":9,"rows_kept":33,"cut":false,"hidden":true,"merged":[[3,2,3,4]]}
["ŠIFRANTI"]
[]
[]
["I. Vrste naprav",null,"KODA",null,null,null,"II. Velikostni razredi naprav"]
[null,null,"Vrsta","Podvrsta","Velikostni razred"]
["1. Hidroelektrarne",null,"HE",0,"1- 4",null,"OVE","Velikostni razred"]
["2. Vetrne elektrarne",null,"VE",0,"1- 4",null,0,1,"manjše od 50 kW"]
["3.1 Sončne elektrarne - na stavbah",null,"SE",1,"1- 4",null,50,2,"manjše od 1 MW"]
["3.2 Sončne elektrarne - samostojni objekti",null,"SE",2,"1- 4",null,1000,3,"od 1 MW do vključno 10 MW"]
["4. Geotermalne elektrarne",null,"GT",0,"1- 4",null,10000.01,4,"nad 10 MW do vključno 125 MW"]
["5.1 Elektrarne na lesno biomaso",null,"LB",1,"1- 4",null,125000,5,"nad 125 MW"]
["5.2.Sosežig lesne biomase >5%",null,"LB",2,"1- 4"]
["5.3.Sosežig lesne biomase <5%",null,"LB",3,"1- 4",null,"SPTE","Velikostni razred"]
["6.1 Bioplinske enote - biomasa",null,"BP",1,"1- 3",null,0,1,"manjše od 50 kW"]
["6.2 Bioplinske enote - odpadki",null,"BP",2,"1- 3",null,50,2,"manjše od 1 MW"]
["7. Elektrarne na bioplin iz čistilnih naprav",null,"ČN",0,"1- 3",null,1000,3,"od 1 MW do vključno 5 MW"]
["8. Elektrarne na odlagališčni plin",null,"OP",0,"1- 3",null,5000.01,4,"nad 5 MW do vključno 25 MW"]
["9. Elektrarne na biološko razgradljive odpadke",null,"BO",0,"2- 4",null,25000.01,5,"nad 25 MW do vključno 50 MW"]
["10. Soproizvodnja na lesno biomaso",null,"SL",1.2,"1- 6",null,50000.01,6,"nad 50 MW do 200 MW"]
["11. Soproizvodnja na fosilna goriva",null,"SF",1.2,"1- 6",null,200000,7,"200 MW in več"]
["12. Drugo - individualna obravnava OVE",null,"IO",0,"/"]
["13. Drugo - individualna obravnava SPTE",null,"IS",0,"/"]
[null,null,"Obratovalne ure SPTE:"]
[null,null,"Do 4.000",1]
[null,null,"Nad 4.000",2]
[]
["III. Dodatki"]
[]
["1. Integirane SE","INT",0.15,"NDRS"]
["2. Izkoriščanje odpadne toplote","T",0.1,"OP"]
["3. Substrat bioplin - > 30% gnoja","S1",0.1,"OP"]
["4. Substrat bioplin - > 70% gnoja","S2",0.2,"OP"]
["5. Sestava lesne biomase","LB",null,"SDRS"]

{"sheet":"Primerjava stari - novi 2010","index":10,"n_rows":116,"n_cols":11,"rows_kept":116,"cut":false,"hidden":true,"merged":[[76,0,83,0],[76,1,83,1],[76,2,79,4],[66,1,67,1],[66,3,67,3],[52,0,63,0],[52,1,57,1],[58,1,63,1],[58,2,63,2],[52,2,57,2],[52,3,57,3],[52,4,57,4],[58,3,63,3],[58,4,63,4],[35,0,42,0],[43,0,50,0],[35,1,36,1],[35,2,36,2],[35,3,36,3],[35,4,36,4],[37,8,39,8],[40,8,42,8],[43,8,46,8],[47,8,50,8],[37,1,42,1],[37,2,42,2],[37,3,42,3],[37,4,42,4],[43,1,50,1],[43,2,50,2],[43,3,50,3],[43,4,50,4],[11,0,26,0],[17,1,26,1],[17,2,26,2],[17,3,26,3],[17,4,26,4],[17,8,18,8],[4,8,6,8],[4,9,6,9],[7,0,10,0],[7,1,8,1],[19,8,22,8],[23,8,26,8],[7,2,8,2],[7,3,8,3],[7,4,8,4],[7,8,10,8],[9,1,10,1],[9,2,10,2],[9,3,10,3],[9,4,10,4],[11,1,16,1],[11,2,16,2],[11,3,16,3],[11,4,16,4],[3,0,3,4],[4,0,6,0],[4,1,6,1],[4,2,6,2],[4,3,5,3],[4,4,5,4],[4,5,5,5],[4,6,5,6],[4,7,6,7],[3,5,3,10],[4,10,6,10],[31,4,34,4],[31,8,34,8],[27,0,30,0],[27,1,28,1],[27,2,28,2],[27,3,28,3],[27,4,28,4],[27,8,30,8],[29,1,30,1],[29,2,30,2],[31,0,34,0],[31,1,34,1],[31,2,34,2],[31,3,34,3],[29,3,30,3],[29,4,30,4],[84,0,85,6],[66,4,67,4],[66,8,67,8],[68,1,71,1],[68,2,71,2],[68,3,71,3],[68,4,71,4],[68,8,69,8],[80,2,83,2],[80,8,81,8],[82,8,83,8],[70,8,71,8],[72,8,73,8],[74,8,75,8],[76,8,77,8],[78,8,79,8],[72,1,75,4],[80,3,83,3],[80,4,83,4],[64,0,75,0],[64,1,65,1],[64,2,67,2],[64,3,65,3],[64,4,65,4],[7,10,10,10],[27,10,30,10],[40,10,42,10],[64,10,67,10],[68,10,71,10],[72,10,75,10],[78,10,79,10],[82,10,83,10],[51,5,51,10],[52,8,53,8],[54,8,55,8],[62,8,63,8],[56,8,57,8],[58,8,59,8],[60,8,61,8],[64,8,65,8],[11,8,12,8],[13,8,14,8],[15,8,16,8]]}
["PRIMERJAVA STARE IN NOVE PODPORNE SHEME"]
[]
["Cene so brez 20% DDV.",null,null,null,"Velja od : 1.11.2009",null,null,null,null,null,"Velja od : 1.1.2010"]
["STARA PODPORNA SHEMA",null,null,null,null,"NOVA PODPORNA SHEMA"]
["Vrsta KE glede na vir primarne energije","Št. Vira","Velikostni razred","Enotna letna cena ELC","Enotna letna premija  ELP","Cena zagotovljenega odkupa","Obratovalna podpora","Velikostni razred","Vrsta proizvodne naprave","Koda","Možni dodatki"]
[]
[null,null,null,"€/MWh","€/MWh","€/MWh","€/MWh"]
["Hidroelektrarne",1,"do vključno 1 MW",65.72,12.1,105.47,59.54,1,"1. Hidroelektrarne","HE01","/"]
[null,null,null,null,null,92.61,46.68,2,null,"HE02"]
[null,2,"nad 1 MW do 10 MW",63.41,10,82.34,34.270000000000003,3,null,"HE03"]
[null,null,null,null,null,"(ni ZO)",28.5,4,null,"HE04"]
["KE na biomaso",3,"do vključno 1 MW",123.17,70.790000000000006,"(indvid.)","(indvid.)",1,"5.1 Elektrarne na lesno biomaso","LB11","LB"]
[null,null,null,null,null,225.73999999999998,177.14,2,null,"LB12","LB"]
[null,null,null,null,null,"(indvid.)","(indvid.)",1,"10. SPTE na lesno biomaso (do 4.000 ur)","SL11","LB"]
[null,null,null,null,null,327.45,280.45,2,null,"SL12","LB"]
[null,null,null,null,null,"(indvid.)","(indvid.)",1,"10. SPTE na lesno biomaso (več kot 4.000 ur)","SL21","LB"]
[null,null,null,null,null,220.8,171.66,2,null,"SL22","LB"]
[null,4,"nad 1 MW",119.35,66.97,168.6,119.46,3,"5.1 Elektrarne na lesno biomaso","LB13","LB"]
[null,null,null,null,null,"(ni ZO)","(indvid.)",4,null,"LB14","LB"]
[null,null,null,null,null,"(ni ZO)",203.76,3,"10. SPTE na lesno biomaso (do 4.000 ur)","SL13","LB"]
[null,null,null,null,null,"(ni ZO)",137.94999999999999,4,null,"SL14","LB"]
[null,null,null,null,null,"(ni ZO)",105.07,5,null,"SL15","LB"]
[null,null,null,null,null,"(ni ZO)","(indvid.)",6,null,"SL16","LB"]
[null,null,null,null,null,"(ni ZO)",122.76,3,"10. SPTE na lesno biomaso (več kot 4.000 ur)","SL23","LB"]
[null,null,null,null,null,"(ni ZO)",79.5,4,null,"SL24","LB"]
[null,null,null,null,null,"(ni ZO)",58.33,5,null,"SL25","LB"]
[null,null,null,null,null,"(ni ZO)","(indvid.)",6,null,"SL26","LB"]
["Vetrne KE",5,"do vključno 1 MW",64.84,12.46,95.38,52.65,1,"2. Vetrne elektrarne","VE01","/"]
[null,null,null,null,null,95.38,52.65,2,null,"VE02"]
[null,6,"nad 1 MW",62.61,10.23,95.38,52.65,3,null,"VE03"]
[null,null,null,null,null,"(ni ZO)",40.81,4,null,"VE04"]
["Geotermalne KE",7,null,61.61,10.23,152.47,103.33,1,"4. Geotermalne elektrarne","GT01","T"]
[null,null,null,null,null,152.47,103.33,2,null,"GT02","T"]
[null,null,null,null,null,152.47,103.33,3,null,"GT03","T"]
[null,null,null,null,null,"(ni ZO)","(indvid.)",4,null,"GT04","T"]
["Sončne KE",8,"do vključno 50 kW",399.57,347.19,386.38,339.38,1,"3.1 Sončne elektrarne - na stavbah","SE11","INT"]
[null,null,null,null,null,363.09,316.08999999999997,1,"3.2 Sončne elektrarne - samostojni objekti","SE21","/"]
[null,9,"nad 50 kW",399.57,347.19,353.42,306.42,2,"3.1 Sončne elektrarne - na stavbah","SE12","INT"]
[null,null,null,null,null,293.27999999999997,244.68,3,null,"SE13","INT"]
[null,null,null,null,null,"(ni ZO)",207.65,4,null,"SE14","INT"]
[null,null,null,null,null,334.53,287.52999999999997,2,"3.2 Sončne elektrarne - samostojni objekti","SE22","/"]
[null,null,null,null,null,269.68,221.08,3,null,"SE23"]
[null,null,null,null,null,"(ni ZO)",196.96,4,null,"SE24"]
["Druge KE 2",10,null,120.89,68.510000000000005,160.56,113.56,1,"6.1 Bioplinske enote - biomasa","BP11","T, S1 ali S2"]
[null,null,null,null,null,156.31,107.71,2,null,"BP12","T, S1 ali S2"]
[null,null,null,null,null,141.42000000000002,92.28,3,null,"BP13","T, S1"]
[null,null,null,null,null,"(ni predv.)","(ni predv.)",4,null,"BP14","T, S1"]
[null,null,null,null,null,139.22999999999999,92.23,1,"6.2 Bioplinske enote - odpadki","BP21","T"]
[null,null,null,null,null,139.22999999999999,90.63,2,null,"BP22","T"]
[null,null,null,null,null,129.15,80.010000000000005,3,null,"BP23","T"]
[null,null,null,null,null,"(ni predv.)","(ni predv.)",4,null,"BP24","T"]
["Kombinirane KE na OVE3",11,null,66.98,14.6,0]
["KE ali toplarne na  komunalne odpadke 4",12,"do vključno 1 MW",56.77,4.3899999999999997,85.84,36.700000000000003,1,"7. Elektrarne na bioplin iz čistilnih naprav","ČN01","T"]
[null,null,null,null,null,74.42,25.28,2,null,"ČN02","T"]
[null,null,null,null,null,99.33,50.19,1,"8. Elektrarne na odlagališčni plin","OP01","T"]
[null,null,null,null,null,67.47,18.329999999999998,2,null,"OP02","T"]
[null,null,null,null,null,"(ni predv.)","(ni predv.)",1,"9. Elektrarne na biološko razgradljive odpadke","BO01","T"]
[null,null,null,null,null,77.44,28.3,2,null,"BO02","T"]
[null,13,"nad 1 MW do \n10 MW",52.89,0.51,66.09,16.95,3,"7. Elektrarne na bioplin iz čistilnih naprav","ČN03","T"]
[null,null,null,null,null,"(ni predv.)","(ni predv.)",4,null,"ČN04","T"]
[null,null,null,null,null,61.67,12.53,3,"8. Elektrarne na odlagališčni plin","OP03","T"]
[null,null,null,null,null,"(ni predv.)","(ni predv.)",4,null,"OP04","T"]
[null,null,null,null,null,74.34,25.2,3,"9. Elektrarne na biološko razgradljive odpadke","BO03","T"]
[null,null,null,null,null,"(ni ZO)","(indvid.)",4,null,"BO04","T"]
["Toplarne za daljinsko ogrevanje in\nindustrijske toplarne 5",14,"do vključno 1 MW",79.63,27.25,232.01,186.61,1,"11. SPTE na fosilna goriva (do 4.000 ur)","SF11","/"]
[null,null,null,null,null,150.51999999999998,103.52,2,null,"SF12"]
[null,16,null,77.349999999999994,"/",174.17000000000002,126.1,1,"11. SPTE na fosilna goriva (več kot 4.000 ur)","SF21"]
[null,null,null,null,null,119.99,70.849999999999994,2,null,"SF22"]
[null,15,"nad 1 MW do \n10 MW",75.069999999999993,22.69,"(ni ZO)",66.22,3,"11. SPTE na fosilna goriva (do 4.000 ur)","SF13","/"]
[null,null,null,null,null,"(ni ZO)",62.02,4,null,"SF14"]
[null,null,null,null,null,"(ni ZO)",42.01,3,"11. SPTE na fosilna goriva (več kot 4.000 ur)","SF23"]
[null,null,null,null,null,"(ni ZO)",40.75,4,null,"SF24"]
[null,"/",null,null,null,"(ni ZO)",64.13,5,"11. SPTE na fosilna goriva (do 4.000 ur)","SF15","/"]
[null,null,null,null,null,"(ni ZO)",54.01,6,null,"SF16"]
[null,null,null,null,null,"(ni ZO)",38.68,5,"11. SPTE na fosilna goriva (več kot 4.000 ur)","SF25"]
[null,null,null,null,null,"(ni ZO)",30.49,6,null,"SF26"]
["Sosežig biomase 1",17,"/",null,null,"(ni ZO)",56.68,1,"5.2.Sosežig lesne biomase >5%","LB21","LB"]
[null,null,null,null,null,"(ni ZO)",55.08,2,null,"LB22","LB"]
[null,null,null,null,null,"(ni ZO)",35.520000000000003,1,"5.3.Sosežig lesne biomase <5%","LB31","/"]
[null,null,null,null,null,"(ni ZO)",35.520000000000003,2,null,"LB32"]
[null,null,"nad 1 MW",null,22,"(ni ZO)",54.54,3,"5.2.Sosežig lesne biomase >5%","LB23","LB"]
[null,null,null,null,null,"(ni ZO)","(indvid.)",4,null,"LB24","LB"]
[null,null,null,null,null,"(ni ZO)",35.520000000000003,3,"5.3.Sosežig lesne biomase <5%","LB33","/"]
[null,null,null,null,null,"(ni ZO)",35.520000000000003,4,null,"LB34"]
["/",null,null,null,null,null,null,"1 do 4","12. Individualna obravnava OVE","IO"]
[null,null,null,null,null,null,null,"1 do 6","13. Individualna obravnava SPTE","IS"]
[]
["OPOMBE"]
["\"STARA SHEMA\""]
["1  Sosežig lesne biomase v termoelektrarnah, kjer predstavlja biomasa do 5% energetske vrednosti vhodne energije in kjer za sosežig ni opravljena rekonstrukcija kurilne naprave. Cena velja za leto 2008; v letu 2009 je bila premija ločena po tipu premoga in določena v posebnem sklepu, skupaj z omejitvijo proizvedene EE (Sklep o določitvi količine električne energije proizvedene s sosežigom biomase ter o višini premije v letu 2009, Ur.l. RS, št. 17/2009)"]
["2  Elektrarne, ki kot vhodno energijo uporabljajo katerokoli drugo vrsto obnovljive energije, ki ni fosilnega ali jedrskega izvora, v to skupino sodijo KE na bioplin iz živalskih in rastlinskih odpadkov v kmetijski dejavnosti."]
["3  Kombinacije navedenih elektrarn na obnovljive vire."]
["4  KE in toplarne na komunalne odpadke vključujejo tudi KE na deponijski plin in KE na plin iz komunalnih čistilnih naprav."]
["5  Povprečna odkupna cena za industrijske toplarne do 1 MW velja za vse viške nad porabo, ki jih kvalificirani proizvajalec odda v javno omrežje."]
[]
["\"NOVA SHEMA\""]
["DODATKI","Oznaka","Velikost","Obračunan na","POSEBNI POGOJI"]
["1. Integirane SE","INT",0.15,"NDRS","sestavni del ovoja, gradbeno dovoljenje"]
["2. Izkoriščanje odpadne toplote","T",0.1,"OP","GT in BO koristna izraba nad 30% vhodne toplote, ostali nad 15%"]
["3. Substrat bioplin - > 30% gnoja","S1",0.1,"OP"]
["4. Substrat bioplin - > 70% gnoja","S2",0.2,"OP","nazivna električna moč do 200 kW"]
["5. Sestava lesne biomase","LB","tehtano po sestavi","SDRS","v določenih primerih je lahko tudi odbitek"]
[]
["Pri SE so upoštevani referenčni stroški 2010"]
[]
["(individ,) = individualna obravnava"]
["(ni predv.) = podpora za kategorijo ni predvidena"]
["(ni ZO) = zagotovljeni odkup ni možen"]
[]
["Velikostni razred OVE","Velikostni razred SPTE"]
["1 manjše od 50 kW","1 manjše od 50 kW"]
["2 manjše od 1 MW","2 manjše od 1 MW"]
["3 od 1 MW do vključno 10 MW","3 od 1 MW do vključno 5 MW"]
["4 nad 10 MW do vključno 125 MW","4 nad 5 MW do vključno 25 MW"]
[null,"5 nad 25 MW do vključno 50 MW"]
[null,"6 nad 50 MW do 200 MW"]

{"sheet":"Stara shema","index":11,"n_rows":236,"n_cols":5,"rows_kept":236,"cut":false,"hidden":true,"merged":[[37,0,37,4],[28,0,28,4],[29,0,29,4],[30,0,30,4],[31,0,31,4],[34,0,34,4],[35,0,35,4],[27,0,27,4],[0,0,0,4],[1,0,1,4],[5,0,7,0],[5,1,7,1],[5,2,7,2],[5,3,6,3],[5,4,6,4],[8,0,9,0],[10,0,11,0],[12,0,13,0],[15,0,16,0],[26,0,26,4]]}
[]
["CENIK ENOTNIH LETNIH CEN IN PREMIJ ZA ODKUP ELEKTRIČNE ENERGIJE OD KE (\"stara shema\")"]
[]
["Cene so brez 20% DDV.",null,null,null,"Velja od : 1.1.2011"]
[]
["Vrsta KE glede na vir primarne energije","Št. Vira","Velikostni razred","Enotna letna cena ELC","Enotna letna premija  ELP"]
[]
[null,null,null,"€/MWh","€/MWh"]
["Hidroelektrarne",1,"do vključno 1 MW",65.72,11.72]
[null,2,"nad 1 MW do 10 MW",63.41,9.69]
["KE na biomaso",3,"do vključno 1 MW",123.17,70.790000000000006]
[null,4,"nad 1 MW",119.35,66.97]
["Vetrne KE",5,"do vključno 1 MW",64.84,12.46]
[null,6,"nad 1 MW",62.61,10.23]
["Geotermalne KE",7,null,61.61,10.23]
["Sončne KE",8,"do vključno 50 kW",399.57,347.19]
[null,9,"nad 50 kW",399.57,347.19]
["Druge KE 2",10,null,120.89,68.510000000000005]
["Kombinirane KE na OVE 3",11,null,66.98,14.6]
["KE ali toplarne na  ",12,"do vključno 1 MW",56.77,4.3899999999999997]
["komunalne odpadke 4",13,"nad 1 MW do 10 MW",52.89,0.51]
["Toplarne za daljinsko  ",14,"do vključno 1 MW",79.63,27.25]
["ogrevanje",15,"nad 1 MW do 10 MW",75.069999999999993,22.69]
["Industrijske toplarne 5",16,"do vključno 1 MW",77.349999999999994]
["Sosežig biomase 1",17,"nad 1 MW",null,"(glej opombo)"]
[]
["Opombe:"]
["1  Sosežig lesne biomase v termoelektrarnah, kjer predstavlja biomasa do 5% energetske vrednosti vhodne energije in kjer za sosežig ni opravljena rekonstrukcija kurilne naprave. Premija za leto 2008 je bila 22 EUR/MWh; v letu 2009 je bila premija ločena po tipu premoga in določena v posebnem sklepu, skupaj z omejitvijo proizvedene EE (Sklep o določitvi količine električne energije proizvedene s sosežigom biomase ter o višini premije v letu 2009, Ur.l. RS, št. 17/2009) - glej sklep spodaj"]
["2  Elektrarne, ki kot vhodno energijo uporabljajo katerokoli drugo vrsto obnovljive energije, ki ni fosilnega ali jedrskega izvora, v to skupino sodijo KE na bioplin iz živalskih in rastlinskih odpadkov v kmetijski dejavnosti."]
["3  Kombinacije navedenih elektrarn na obnovljive vire."]
["4  KE in toplarne na komunalne odpadke vključujejo tudi KE na deponijski plin in KE na plin iz komunalnih čistilnih naprav."]
["5  Povprečna odkupna cena za industrijske toplarne do 1 MW velja za vse viške nad porabo, ki jih kvalificirani proizvajalec odda v javno omrežje."]
[]
["Uporabljeni kratici:"]
["KE : kvalificirana elektrarna"]
["OVE : obnovljivi viri energije"]
[]
["PREMIJE ZA HE"]
["Sklep o cenah in premijah za odkup električne energije od kvalificiranih proizvajalcev električne energije (Uradni list RS št. 65/08 in 98/08): koda 1 premija 13,34; koda 2 premija 11,03 EUR/MWh"]
["Sklep o premijah za elektricno energijo, proizvedeno v hidroelektrarnah (Uradni list RS št. 85/09) - SPREMEMBA PREMIJ ZA HE, v veljavi od 1.11.2009 dalje: koda 1 = 12,10 ; koda 2 = 10,00 EUR/MWh"]
["Sklep o o uskladitvi premij za odkup električne energije, proizvedene v hidroelektrarnah, za leto 2010 (Uradni list RS št. 106/2010) - SPREMEMBA PREMIJ ZA HE, v veljavi od 1.1.2011 dalje: koda 1 = 11,72 ; koda 2 = 9,69 EUR/MWh"]
[]
[]
["Uradni list RS, št. 65/2008"]
["z dne 30. 6. 2008"]
["Natisni"]
["2822. Sklep o cenah in premijah za odkup električne energije od kvalificiranih proizvajalcev električne energije, Stran 8705."]
[]
[]
["Na podlagi 10. člena Uredbe o pravilih za določitev cen in za odkup električne energije od kvalificiranih proizvajalcev električne energije (Uradni list RS, št. 25/02) je Vlada Republike Slovenije sprejela"]
["S K L E P"]
["o cenah in premijah za odkup električne energije od kvalificiranih proizvajalcev električne energije"]
["I."]
["Enotne letne cene za odkup električne energije od kvalificiranih proizvajalcev in enotne letne premije za električno energijo, ki jo kvalificirani proizvajalci prodajo samostojno ali preko posrednika, so:"]
["+---------------------+----------------+-----------+-----------+"]
["|Vrsta KE glede na    |Velikostni      |Enotna     |Enotna     |"]
["|vir primarne         |razred          |letna cena |letna      |"]
["|energije             |                |(€/MWh)    |premija    |"]
["|                     |                |           |(€/MWh)    |"]
["+---------------------+----------------+-----------+-----------+"]
["|hidroelektrarne      |do vključno     |      65,72|      13,34|"]
["|                     |1 MW            |           |           |"]
["|                     +----------------+-----------+-----------+"]
["|                     |nad 1 MW do 10  |      63,41|      11,03|"]
["|                     |MW              |           |           |"]
["+---------------------+----------------+-----------+-----------+"]
["|KE na biomaso        |do vključno     |     123,17|      70,79|"]
["|                     |1 MW            |           |           |"]
["|                     +----------------+-----------+-----------+"]
["|                     |nad 1 MW        |     119,35|      66,97|"]
["+---------------------+----------------+-----------+-----------+"]
["|sosežig              |nad 1 MW        |          /|      22,00|"]
["|biomase(1)           |                |           |           |"]
["+---------------------+----------------+-----------+-----------+"]
["|vetrne KE            |do vključno     |      64,84|      12,46|"]
["|                     |1 MW            |           |           |"]
["|                     +----------------+-----------+-----------+"]
["|                     |nad 1 MW        |      62,61|      10,23|"]
["+---------------------+----------------+-----------+-----------+"]
["|geotermalne KE       |                |      62,61|      10,23|"]
["+---------------------+----------------+-----------+-----------+"]
["|sončne KE            |do vključno 50  |     399,57|     347,19|"]
["|                     |kW              |           |           |"]
["|                     +----------------+-----------+-----------+"]
["|                     |nad 50 kW       |     399,57|     347,19|"]
["+---------------------+----------------+-----------+-----------+"]
["|druge KE(2)          |                |     120,89|      83,33|"]
["+---------------------+----------------+-----------+-----------+"]
["|kombinirane KE na    |                |      66,98|      29,42|"]
["|OVE(3)               |                |           |           |"]
["+---------------------+----------------+-----------+-----------+"]
["|KE ali toplarne na   |do vključno     |      56,77|       4,39|"]
["|komunalne odpadke(4) |1 MW            |           |           |"]
["|                     +----------------+-----------+-----------+"]
["|                     |nad 1 MW do 10  |      52,89|       0,51|"]
["|                     |MW              |           |           |"]
["+---------------------+----------------+-----------+-----------+"]
["|toplarne za          |do vključno     |      79,63|      27,25|"]
["|daljinsko            |1 MW            |           |           |"]
["|ogrevanje            +----------------+-----------+-----------+"]
["|                     |nad 1 MW do 10  |      75,07|      22,69|"]
["|                     |MW              |           |           |"]
["+---------------------+----------------+-----------+-----------+"]
["|industrijske         |do vključno     |      77,35|          /|"]
["|toplarne(5)          |1 MW            |           |           |"]
["+---------------------+----------------+-----------+-----------+"]
["(1) Sosežig lesne biomase v termoelektrarnah, kjer predstavlja biomasa do 5% energetske vrednosti vhodne energije in kjer za sosežig ni opravljena rekonstrukcija kurilne naprave."]
["Količina električne energije iz proizvedene iz biomase na prej določeni način, ki prejema enotno letno premijo, v letu 2008 ne sme preseči 130 GWh."]
["(2) Elektrarne, ki kot vhodno energijo uporabljajo katerokoli drugo vrsto obnovljive energije, ki ni fosilnega ali jedrskega izvora, v to skupino sodijo KE na bioplin iz živalskih in rastlinskih odpadkov v kmetijski dejavnosti."]
["(3) Kombinacije navedenih elektrarn na obnovljive vire."]
["(4) KE in toplarne na komunalne odpadke vključujejo tudi KE na deponijski plin in KE na plin iz komunalnih čistilnih naprav."]
["(5) Povprečna odkupna cena za industrijske toplarne do 1 MW velja za vse viške nad lastno porabo, ki jih kvalificirani proizvajalec odda v javno omrežje."]
["V tabeli uporabljeni kratici pomenita:"]
["– KE: kvalificirana elektrarna,"]
["– OVE: obnovljivi viri energije."]
["II."]
["Enotne letne cene in enotne letne premije ne vsebujejo davka na dodano vrednost."]
["III."]
["Z dnem uveljavitve tega sklepa preneha veljati Sklep o cenah in premijah za odkup električne energije od kvalificiranih proizvajalcev električne energije (Uradni list RS, št. 75/06)."]
["IV."]
["Ta sklep začne veljati naslednji dan po objavi v Uradnem listu Republike Slovenije."]
["Št. 36001-4/2008/10"]
["Ljubljana, dne 18. junija 2008"]
["EVA 2008-2111-0058"]
["Vlada Republike Slovenije"]
["Janez Janša l.r."]
["Predsednik"]
[]
[]
[]
["Uradni list RS, št. 98/2008"]
["z dne 14. 10. 2008"]
["Natisni"]
["4182. Sklep o spremembah Sklepa o cenah in premijah za odkup električne energije od kvalificiranih proizvajalcev električne energije, Stran 13237."]
[]
[]
["Na podlagi 10. člena Uredbe o pravilih za določitev cen in za odkup električne energije od kvalificiranih proizvajalcev električne energije (Uradni list RS, št. 25/02) je Vlada Republike Slovenije sprejela"]
["S K L E P"]
["o spremembah Sklepa o cenah in premijah za odkup električne energije od kvalificiranih proizvajalcev električne energije"]
["I."]
["V Sklepu o cenah in premijah za odkup električne energije od kvalificiranih proizvajalcev električne energije (Uradni list RS, št. 65/08) se v tabeli enotna letna premija za druge KE spremeni tako, da se znesek »83,33« nadomesti z zneskom »68,51«."]
["II."]
["Enotna letna premija za kombinirane KE na OVE se spremeni tako, da se znesek »29,42« nadomesti z zneskom »14,60«."]
["III."]
["Enotna letna cena iz I. točke tega sklepa velja za leto 2008."]
["IV."]
["Ta sklep začne veljati naslednji dan po objavi v Uradnem listu Republike Slovenije."]
["Št. 36001-5/2008/6"]
["Ljubljana, dne 1. oktobra 2008"]
["EVA 2008-2111-0094"]
["Vlada Republike Slovenije"]
["Janez Janša l.r."]
["Predsednik"]
[]
[]
[]
["Uradni list RS, št. 85/2009"]
["z dne 30. 10. 2009"]
["Natisni"]
["3797. Sklep o premijah za električno energijo, proizvedeno v hidroelektrarnah, Stran 11375."]
[]
[]
["Na podlagi tretje alinee tretjega odstavka 42. člena Zakona o spremembah in dopolnitvah Energetskega zakona (Uradni list RS, št. 70/08) je Vlada Republike Slovenije sprejela"]
["S K L E P"]
["o premijah za električno energijo, proizvedeno v hidroelektrarnah"]
["I."]
["Enotna letna premija za električno energijo, proizvedeno v hidroelektrarnah, ki jo proizvajalci samostojno prodajajo, znaša:"]
["– 12,10 €/MWh za hidroelektrarne nazivnih moči do vključno 1 MW,"]
["– 10,00 €/MWh za hidroelektrarne nazivnih moči nad 1 MW do vključno 10 MW."]
["II."]
["Z dnem uveljavitve tega sklepa preneha veljati enotna letna premija za električno energijo iz hidroelektrarn, določena v I. točki Sklepa o cenah in premijah za odkup električne energije od kvalificiranih proizvajalcev električne energije (Uradni list RS, št. 65/08, 98/08 in 105/08)."]
["III."]
["Ta sklep začne veljati naslednji dan po objavi v Uradnem listu Republike Slovenije."]
["Št. 36000-8/2009/4"]
["Ljubljana, dne 22. oktobra 2009"]
["EVA 2009-2111-0046"]
["Vlada Republike Slovenije"]
["Borut Pahor l.r."]
["Predsednik"]
[]
[]
[]
["Uradni list RS, št. 106/2010"]
["z dne 27. 12. 2010"]
["Natisni"]
["5495. Sklep o uskladitvi premij za odkup električne energije, proizvedene v hidroelektrarnah, za leto 2010, Stran 16460."]
[]
[]
["Na podlagi tretje alinee tretjega odstavka 42. člena Zakona o spremembah in dopolnitvah Energetskega zakona (Uradni list RS, št. 70/08) je Vlada Republike Slovenije sprejela"]
["S K L E P"]
["o uskladitvi premij za odkup električne energije, proizvedene v hidroelektrarnah, za leto 2010"]
["I."]
["Enotna letna premija za električno energijo, proizvedeno v hidroelektrarnah, ki jo proizvajalci samostojno prodajajo, znaša:"]
["– 11,72 €/MWh za hidroelektrarne nazivnih moči do vključno 1MW,"]
["– 9,69 €/MWh za hidroelektrarne nazivnih moči nad 1MW do vključno 10MW."]
["II."]
["Z dnem uveljavitve tega sklepa preneha veljati enotna letna premija za električno energijo iz hidroelektrarn, določena v I. točki Sklepa o premijah za električno energijo, proizvedeno v hidroelektrarnah (Uradni list RS, št. 85/09)."]
["III."]
["Ta sklep začne veljati naslednji dan po objavi v Uradnem listu Republike Slovenije."]
["Št. 36000-11/2010"]
["Ljubljana, dne 23. decembra 2010"]
["EVA 2010-2111-0117"]
["Vlada Republike Slovenije"]
["mag. Mitja Gaspari l.r."]
["Minister"]
[]
[]
[]
[]
["Uradni list RS, št. 17/2009"]
["z dne 6. 3. 2009"]
["Natisni"]
["647. Sklep o določitvi količine električne energije, proizvedene s sosežigom biomase, ter o višini premije v letu 2009, Stran 2314."]
[]
[]
["Na podlagi pete alinee tretjega odstavka 42. člena Zakona o spremembah in dopolnitvah Energetskega zakona (Uradni list RS, št. 70/08) Vlada Republike sprejme"]
["S K L E P"]
["o določitvi količine električne energije, proizvedene s sosežigom biomase, ter o višini premije v letu 2009"]
["I."]
["Premija za električno energijo, proizvedeno s sosežigom biomase, pri katerem predstavlja biomasa do 5% energijske vrednosti vhodne energije in kjer za sosežig ni opravljena rekonstrukcija kurilne naprave, znaša:"]
["– za sosežig biomase in lignita: 33,6 €/MWh,"]
["– za sosežig biomase in rjavega premoga: 19,2 €/MWh."]
["II."]
["Količina električne energije, ki je upravičena do premije za sosežig, znaša:"]
["– 185 GWh za sosežig biomase in lignita,"]
["– 31 GWh za sosežig biomase in rjavega premoga."]
["III."]
["Premija za električno energijo, proizvedeno s sosežigom, na podlagi pogodbe o zagotavljanju podpor ter na podlagi predanih potrdil o izvoru centru za podpore izplačuje center za podpore pri družbi Borzen, d.o.o.. Dinamika izplačevanja podpore se uredi s pogodbo med centrom za podpore in proizvajalci električne energije s sosežigom biomase glede na razpoložljiva sredstva."]
["IV."]
["Ta sklep začne veljati naslednji dan po objavi v Uradnem listu Republike Slovenije."]
["Št. 36000-2/2009/4"]
["Ljubljana, dne 5. marca 2009"]
["EVA 2009-2111-0043"]
["Vlada Republike Slovenije"]
["Borut Pahor l.r."]
["Predsednik"]